program: Gaussian 09
title: 000086932
version: EM64L-G09RevD.01
frameworkgroup: C1[X(C8H18O)]
method: RPBEPBE
basis: SDD
operation: Freq
keyword: #pfreq=noraman
keyword: PBEPBE/SDD
title: #p freq=noraman PBEPBE/SDD
converged: YES YES YES YES
title: Mulliken charges:
elementType: O C C C C C C C C H H H H H H H H H H H H H H H H H H
charge: -0.282353 -0.075449 -0.233453 -0.371898 -0.240136 -0.346572 -0.694911 -0.703054 -0.686932 0.213153 0.184157 0.170172 0.205502 0.204058 0.177652 0.176267 0.191592 0.191365 0.206849 0.192801 0.248325 0.220028 0.210916 0.203869 0.211567 0.211555 0.214928
chargesum: 0.00000
title: Mulliken charges with hydrogens summed into heavy atoms:
elementType: O C C C C C C C C
charge: -0.282353 0.137704 0.120876 0.037663 0.113783 0.036385 -0.046935 -0.068241 -0.048882
polarizability: 1.16164779e+02 -1.37279905e+00 8.40309049e+01 -2.78937466e-01 -2.25206879e-01 7.77598870e+01
1716.lowfreq: -9.6779 -4.2869 -0.0006 0.0001 0.0007 16.0381 34.9491 47.1318 72.3738
frequency: 33.4860 47.0552 72.3565 95.8887 114.3245 140.5340 184.3169 200.0486 233.1719 233.7836 251.6967 318.5706 365.7115 408.3564 468.9734 495.0360 741.6484 808.1698 825.3053 883.4771 909.7081 918.0844 932.0485 938.0537 957.5713 969.9416 1026.7194 1064.3233 1083.2817 1118.8729 1133.2988 1147.0206 1158.6215 1190.3636 1210.2826 1228.0658 1268.9917 1271.3502 1282.4005 1294.8741 1337.8507 1342.8673 1355.0010 1375.6969 1388.1988 1391.3565 1406.6097 1462.2049 1469.1992 1469.3726 1472.1239 1477.4051 1477.6572 1481.0597 1485.9785 1490.5926 1493.4382 2892.1100 2904.8649 2944.8851 2946.2327 2965.1984 2967.0655 2972.0246 2974.6316 2990.3959 2992.9457 3008.2574 3053.0773 3057.0767 3065.0317 3072.8258 3073.0836 3073.6157 3094.5313
redmass: 3.0172 1.7975 3.2591 2.3962 2.0269 2.6419 2.6245 1.0990 1.1293 1.1511 2.9625 2.8738 2.4403 2.0402 2.6104 3.9865 1.0731 1.1334 2.5776 2.3626 1.4145 1.2607 1.5659 1.2501 1.8599 1.7672 3.9676 6.3340 2.1748 2.4953 1.5887 1.9328 1.6325 1.7472 1.3801 1.2894 1.2824 1.1565 1.0881 1.3363 1.3628 1.4374 1.5525 1.2245 1.2632 1.2282 1.4019 1.0647 1.0586 1.0612 1.0664 1.0670 1.0422 1.0505 1.0713 1.0609 1.0840 1.0546 1.0545 1.1032 1.1058 1.0586 1.0360 1.0380 1.0363 1.0594 1.0853 1.1004 1.1038 1.0991 1.0987 1.1010 1.0987 1.0994 1.0987
irintensity: 0.1519 0.5940 0.1666 0.2263 2.6791 5.4100 1.3121 0.7749 0.1255 0.0328 0.0097 1.1501 0.8885 1.2607 1.2262 4.6194 8.9885 0.3020 1.5325 18.0191 1.9547 0.5676 9.7306 2.5464 1.4376 3.4808 32.7161 163.0090 5.8144 3.2769 2.0932 4.1163 2.6134 6.0512 0.1061 3.3594 0.1092 0.1187 0.0848 4.6199 7.9534 0.7652 13.6136 20.5725 27.0045 7.2516 3.1879 6.7887 2.4316 1.7631 2.2359 4.5679 12.4336 10.4026 6.3184 11.9010 21.2740 27.0095 110.0095 92.2605 15.4394 35.4378 42.4253 32.1934 30.3828 41.6930 30.8429 6.6091 26.3359 21.5327 70.6172 100.6177 62.4477 52.7837 26.8191
temp: 298.150 k
press: 1.00000 atm
elementType: 8 6 6 6 6 6 6 6 6 1 1 1 1 1 1 1 1 1 1 1 1 1 1 1 1 1 1
symmnumber: 1
zpe: 642695.2 jmol-1
zpe.correction: 0.244790 hartree
zpe.thermalcorrener: 0.257370 hartree
zpe.thermalcorrenthalpy: 0.258314 hartree
zpe.thermalcorrgfe: 0.205168 hartree
zpe.sumelectzpe: -390.080816 hartree
zpe.sumelectthermal: -390.068236 hartree
zpe.sumelectthermalent: -390.067292 hartree
zpe.sumelectthermalfe: -390.120437 hartree
dipole: -0.1746 -1.2163 0.6682
dipole: 1.3987
quadrupole: -56.1114 -58.8069 -58.6360
quadrupole: -0.2233 -0.4001 0.1882
quadrupole: 1.7401 -0.9555 -0.7846 -0.2233 -0.4001 0.1882
hfenergy: -390.3256056 hartree
pointgroup: C01 [X(C8H18O1)]
dipole: 0.0733232 0.4796988 0.2594492 debye
polarizability: 116.1456578|-1.5973223|84.0545468|0.1044988|0.1906298|77.7553657 unknown
InChI: InChI=1S/C8H18O/c1-4-5-6-9-7-8(2)3/h8H,4-7H2,1-3H3
charge 0 multiplicity 1
27 atoms
O  -0.28024 -0.040283 -0.212165
C  -2.715789 -0.112214 -0.329062
C  -1.497413 0.689238 0.161149
C  2.138746 -0.224243 -0.192202
C  0.94234 0.617981 0.261401
C  3.491036 0.36944 0.265726
C  -2.781487 -1.496122 0.354939
C  -4.010591 0.701125 -0.095935
C  4.695805 -0.479384 -0.194623
H  -2.582455 -0.266636 -1.41897
H  -1.486339 1.702636 -0.302548
H  -1.541445 0.8181 1.268701
H  2.116574 -0.308195 -1.296082
H  2.021832 -1.250289 0.207771
H  0.920578 0.703835 1.372714
H  1.006836 1.649291 -0.157304
H  3.501023 0.455504 1.371677
H  3.594743 1.401202 -0.128628
H  -3.608677 -2.103323 -0.057105
H  -2.951221 -1.385459 1.444174
H  -1.834835 -2.043184 0.207645
H  -4.891739 0.146312 -0.466425
H  -3.980401 1.676985 -0.616933
H  -4.166732 0.894603 0.983292
H  4.633017 -1.507234 0.209458
H  4.727747 -0.554906 -1.297769
H  5.652583 -0.04028 0.142802
