program: Gaussian 09
title: 000007917
version: EM64L-G09RevD.01
frameworkgroup: C1[X(C4H7ClO2)]
method: RPBEPBE
basis: SDD
operation: Freq
keyword: #p
keyword: freq=noraman
keyword: PBEPBE/SDD
title: #p freq=noraman PBEPBE/SDD
converged: YES YES NO NO
title: Mulliken charges:
elementType: Cl O O C C C C H H H H H H H
charge: -0.045772 -0.201086 -0.163757 0.016517 -0.673238 -0.667473 0.101967 0.240599 0.213534 0.240847 0.232118 0.221098 0.253979 0.230668
chargesum: 0.00000
title: Mulliken charges with hydrogens summed into heavy atoms:
elementType: Cl O O C C C C
charge: -0.045772 -0.201086 -0.163757 0.257116 0.013261 0.038271 0.101967
polarizability: 8.14891743e+01 -4.74809114e+00 5.55836705e+01 3.42616163e+00 -4.19385970e+00 4.36850285e+01
1716.lowfreq: -16.3032 -6.6523 -0.0040 -0.0034 -0.0028 8.9878 59.0596 93.8920 153.8293
frequency: 58.8896 93.8717 153.8228 186.0416 239.3654 268.8538 362.1005 392.6791 422.9022 454.0697 618.0981 736.9139 766.6000 892.8194 931.5020 939.9516 1058.4739 1101.3868 1157.9095 1187.0113 1313.2714 1332.6913 1386.0719 1401.3813 1455.8073 1464.6510 1473.1959 1486.9752 1690.0712 2994.6268 2998.8986 3031.2642 3090.1672 3098.8187 3105.4767 3110.5673
redmass: 4.3985 4.7815 3.8732 1.0402 1.1273 4.4248 3.6827 3.2013 10.3733 2.5962 11.8381 4.6523 8.9440 2.5975 1.2120 1.3530 5.0066 1.9356 2.0028 1.9256 1.2308 1.5417 1.2567 1.2185 1.0498 1.0477 1.0509 1.0484 12.2035 1.0359 1.0361 1.0873 1.0989 1.0989 1.1012 1.1009
irintensity: 0.9151 0.3070 1.8001 0.0871 0.2070 16.9403 2.8478 10.7574 20.8182 0.6855 10.7702 1.0499 101.4139 6.9075 2.8420 2.0391 667.0168 31.5203 14.2671 5.8746 17.1234 5.5021 37.2050 19.9650 7.6729 4.0420 7.5838 23.6187 319.2619 10.0065 13.0560 7.9293 7.1361 32.2833 12.0375 30.9297
temp: 298.150 k
press: 1.00000 atm
elementType: 17 8 8 6 6 6 6 1 1 1 1 1 1 1
symmnumber: 1
zpe: 277875.8 jmol-1
zpe.correction: 0.105837 hartree
zpe.thermalcorrener: 0.114266 hartree
zpe.thermalcorrenthalpy: 0.115211 hartree
zpe.thermalcorrgfe: 0.072083 hartree
zpe.sumelectzpe: -766.570025 hartree
zpe.sumelectthermal: -766.561596 hartree
zpe.sumelectthermalent: -766.560651 hartree
zpe.sumelectthermalfe: -766.603779 hartree
dipole: -4.1106 -0.5149 0.1650
dipole: 4.1460
quadrupole: -46.0602 -51.8982 -48.2245
quadrupole: -1.2176 0.9403 2.5921
quadrupole: 2.6674 -3.1705 0.5031 -1.2176 0.9403 2.5921
hfenergy: -766.6758619 hartree
pointgroup: C01[X(C4H7Cl1O2)]
dipole: -1.6173619 -0.1337619 -0.1640834 debye
dipolederiv: -0.7337617 -0.3785159 0.0668481 -0.4476503 -0.4801028 0.094797 0.1124286 0.1150329 -0.1246081 -1.8311968 -0.1057036 -0.1807205 0.1749075 -0.5111627 0.0618105 -0.1901855 0.0185198 -0.3180103 -0.6651274 -0.0355748 -0.0382809 0.0757891 -1.0001322 0.2933914 -0.0829529 0.2779688 -0.371123 1.0430505 0.0913783 0.0585504 0.2934893 0.3979594 0.1062401 -0.0401409 0.1082226 0.3787506 -0.1385465 0.0510321 0.0022941 0.0447311 -0.0572791 -0.0521441 0.0326164 -0.0428966 0.0403657 -0.1106913 0.0128328 -0.0020735 -0.0634719 -0.0851997 -0.1069163 0.0176389 -0.1334255 -0.0698389 2.3166943 0.4132925 0.1115438 -0.0037831 1.5545831 -0.5216962 0.1909373 -0.4578287 0.4366335 -0.0274815 0.0258762 -0.0616222 -0.0479261 0.0022663 0.0538437 -0.0049627 0.0455685 -0.0806016 -0.1003112 -0.077655 0.0269333 -0.0916256 0.0332008 0.02568 0.021308 0.0182054 0.1110347 0.1070359 -0.0159539 -0.0380017 0.0173933 -0.0019913 -0.1129797 -0.0263825 -0.1153188 -0.0338925 0.1045828 0.0055958 0.0176582 0.0415495 0.0450955 0.0694747 -0.0253355 0.1105592 -0.0710813 -0.0840749 -0.1168791 0.0170951 -0.1205558 0.0607091 -0.0023481 0.0042546 0.0060714 0.0840447 -0.0007625 0.1285223 0.0252104 0.1103177 0.0245101 -0.0261532 0.0045644 -0.0036712 0.0808088 0.1205902 0.0017523 -0.0054347 0.0168353 0.0175435 0.1170003 -0.0137881 0.0529922 -0.0624823 unknown
polarizability: 78.4882109|9.9784905|59.3796255|0.2880108|-2.9114955|42.890037 unknown
InChI: InChI=1S/C4H7ClO2/c1-3(2)7-4(5)6/h3H,1-2H3
charge 0 multiplicity 1
14 atoms
Cl 2.586901 1.205547 -0.06746
O  0.031963 0.637074 -0.052462
O  1.388247 -1.127115 0.700386
C  -1.248849 -0.194048 0.13074
C  -2.358098 0.848955 0.242118
C  -1.381841 -1.150491 -1.057951
C  1.197924 0.010843 0.263313
H  -1.116515 -0.755217 1.074647
H  -3.324018 0.342654 0.419388
H  -2.167489 1.541144 1.079109
H  -2.437374 1.436511 -0.688643
H  -2.320024 -1.72684 -0.962086
H  -0.544272 -1.867115 -1.091738
H  -1.416955 -0.588201 -2.00716
