program: Gaussian 09
title: 000086918
version: EM64L-G09RevD.01
frameworkgroup: C1[X(C12H20O4)]
method: RPBEPBE
basis: SDD
operation: Freq
keyword: #pfreq=noraman
keyword: PBEPBE/SDD
title: #p freq=noraman PBEPBE/SDD
converged: YES YES NO NO
title: Mulliken charges:
elementType: O O O O C C C C C C C C C C C C H H H H H H H H H H H H H H H H H H H H
charge: -0.263114 -0.240108 -0.418615 -0.235239 -0.378465 -0.370684 -0.376631 -0.353072 -0.392885 -0.356192 -0.293895 -0.695586 0.261006 -0.266321 -0.222629 0.179738 0.195367 0.195372 0.190431 0.190477 0.195679 0.195638 0.188756 0.188717 0.215841 0.215801 0.195302 0.195254 0.232641 0.232542 0.209982 0.216139 0.210005 0.287375 0.287814 0.383562
chargesum: 0.00000
title: Mulliken charges with hydrogens summed into heavy atoms:
elementType: O O O O C C C C C C C C C C C C
charge: -0.263114 -0.240108 -0.035052 -0.235239 0.012273 0.010225 0.014686 0.024401 0.038757 0.034363 0.171287 -0.059460 0.261006 0.021054 0.065185 0.179738
polarizability: 2.35130522e+02 -2.92243728e+00 1.31105220e+02 -6.24435463e-02 -5.10553969e-02 9.48880099e+01
1716.lowfreq: -2.4324 -0.0007 -0.0004 0.0009 4.6499 5.0545 16.5477 27.5653 38.2724
frequency: 13.5716 27.4675 36.8773 41.5002 60.0279 70.2252 80.2951 99.9658 116.3127 125.2518 143.4161 148.9964 159.5720 159.9927 198.9024 232.3986 237.6916 259.9640 292.8329 333.9140 392.4796 447.8796 478.7712 533.4728 569.2561 575.2829 648.6103 704.7478 722.1760 728.5421 730.0716 752.7772 791.2155 858.4266 863.3041 890.0014 919.1309 934.2135 936.7935 958.8490 996.1255 1010.1267 1010.7790 1023.1068 1048.1120 1058.4381 1077.5962 1079.8162 1087.8911 1127.0224 1133.2592 1150.5607 1188.3056 1221.3907 1221.5406 1223.9395 1258.9171 1264.1718 1276.9392 1283.3574 1283.9498 1296.0332 1297.7188 1304.2649 1325.9291 1338.2829 1355.6337 1359.2128 1374.9775 1391.9306 1461.8865 1463.1594 1467.0838 1468.0986 1473.8014 1478.2858 1480.1658 1486.4131 1489.5232 1611.8818 1638.5929 1662.5111 2951.5578 2953.6427 2956.7305 2963.6752 2969.1221 2972.7261 2986.1052 2991.4356 2994.4418 3001.3668 3006.1312 3023.0468 3037.6309 3047.7087 3069.1749 3071.2983 3075.9842 3161.6494 3167.5810 3521.8495
redmass: 5.5117 5.3550 2.0296 3.8101 5.3425 4.9952 1.6785 3.2358 2.1490 4.8711 2.2986 2.0545 2.8396 5.4761 4.4315 1.1335 3.2658 8.4899 4.0483 4.5482 3.7998 3.5057 3.1770 4.0677 1.7385 5.8775 1.8489 7.0627 1.0628 8.5033 1.0803 1.1102 1.1630 1.2093 8.2643 1.9368 2.1433 6.4484 1.1985 4.0559 4.5319 1.1123 1.0903 3.6161 3.1732 2.2415 2.4389 2.2502 2.3504 2.9970 2.6788 1.4639 1.6480 1.2940 1.4140 1.3799 1.2420 1.2943 1.1148 1.5980 1.0540 1.1157 1.0987 1.3436 2.2779 1.4328 1.6127 1.6236 1.5764 1.2184 1.0748 1.0741 1.0699 1.0802 1.0782 1.0420 1.0797 1.0873 1.0965 11.0327 8.6662 6.7013 1.0590 1.0589 1.0592 1.0591 1.0587 1.0366 1.0970 1.0599 1.0993 1.0566 1.1022 1.1042 1.1044 1.1045 1.1007 1.0993 1.1078 1.0969 1.0892 1.0641
irintensity: 0.0086 0.0143 0.1253 1.6025 2.1242 0.4680 0.0341 0.0527 0.0600 2.1600 0.0163 0.0001 0.0078 0.6452 3.5836 0.0786 5.9318 0.1794 0.5375 16.6967 0.3010 15.5804 0.9540 24.4519 73.5949 39.9226 77.7996 1.9174 12.9735 41.7622 0.2013 3.5336 0.2707 0.4779 8.9511 3.8737 0.0073 85.3247 0.8784 71.2599 13.6962 6.7370 51.3729 13.4424 19.5258 248.6781 1.6307 7.5725 48.4861 2.4490 284.7064 1.5219 0.0013 0.0834 109.7548 0.1798 0.0013 1.6464 0.3293 187.8173 0.5145 0.1193 0.0676 3.4114 201.1067 7.8933 0.5979 0.1095 0.1374 11.4759 0.0301 0.0577 0.3251 0.1839 2.1378 12.4980 1.0054 1.7260 33.6404 181.8886 173.0157 3.8140 0.0053 2.1633 0.1153 17.6155 152.3733 36.6214 0.1139 16.3189 0.4634 35.7372 1.2423 0.0134 78.5804 45.3512 89.2964 54.2096 80.7295 0.1565 0.7290 52.8048
temp: 298.150 k
press: 1.00000 atm
elementType: 8 8 8 8 6 6 6 6 6 6 6 6 6 6 6 6 1 1 1 1 1 1 1 1 1 1 1 1 1 1 1 1 1 1 1 1
symmnumber: 1
zpe: 792219.6 jmol-1
zpe.correction: 0.301740 hartree
zpe.thermalcorrener: 0.321092 hartree
zpe.thermalcorrenthalpy: 0.322036 hartree
zpe.thermalcorrgfe: 0.249947 hartree
zpe.sumelectzpe: -768.895825 hartree
zpe.sumelectthermal: -768.876473 hartree
zpe.sumelectthermalent: -768.875529 hartree
zpe.sumelectthermalfe: -768.947618 hartree
dipole: -1.7181 -0.1129 -0.0001
dipole: 1.7218
quadrupole: -86.1471 -109.0066 -95.9572
quadrupole: -1.4177 -0.0248 0.0183
quadrupole: 10.8899 -11.9696 1.0797 -1.4177 -0.0248 0.0183
hfenergy: -769.1975653 hartree
pointgroup: C01 [X(C12H20O4)]
dipole: 0.6758479 0.045955 -0.001005 debye
polarizability: 235.1421394|-2.6838783|131.073723|-0.4017708|0.8326003|94.9078891 unknown
InChI: InChI=1S/C12H20O4/c1-2-3-4-5-6-7-10-16-12(15)9-8-11(13)14/h8-9,13H,2-7,10H2,1H3
charge 0 multiplicity 1
36 atoms
O  -1.371237 0.008058 0.010028
O  -2.624835 -1.966634 -0.032766
O  -7.359054 -0.02155 0.020642
O  -6.110367 1.945105 0.066423
C  3.625158 0.381619 0.000499
C  4.98331 -0.355319 -0.015498
C  2.414287 -0.578165 -0.012721
C  6.197672 0.600163 -0.003697
C  1.059244 0.168269 0.005067
C  7.55569 -0.138356 -0.019225
C  -0.116554 -0.806478 -0.010604
C  8.764233 0.822366 -0.008154
C  -2.565655 -0.712218 -0.004244
C  -3.719826 0.224384 0.020265
C  -4.998971 -0.240534 0.011295
C  -6.151519 0.691981 0.035881
H  3.570021 1.029758 0.899774
H  3.565502 1.059936 -0.87596
H  5.037559 -1.004801 -0.914357
H  5.0428 -1.03361 0.861448
H  2.477052 -1.256619 0.863474
H  2.471487 -1.224916 -0.912967
H  6.146132 1.25033 0.894789
H  6.141196 1.27839 -0.8809
H  0.992726 0.806193 0.907199
H  0.988152 0.840492 -0.871458
H  7.611554 -0.815611 0.857519
H  7.606104 -0.788177 -0.916841
H  -0.129448 -1.43787 -0.918671
H  -0.123506 -1.47362 0.871585
H  8.747614 1.490035 -0.890354
H  9.722018 0.270323 -0.020412
H  8.754095 1.461627 0.894937
H  -3.507744 1.298639 0.045754
H  -5.208995 -1.314814 -0.014308
H  -8.120897 0.61912 0.037554
