program: Gaussian 09
title: 000086910
version: EM64L-G09RevD.01
frameworkgroup: C1[X(C18H16ClN)]
method: RPBEPBE
basis: SDD
operation: Freq
keyword: #p
keyword: freq=noraman
keyword: PBEPBE/SDD
title: #p freq=noraman PBEPBE/SDD
converged: YES YES NO NO
title: Mulliken charges:
elementType: Cl N C C C C C C C C C C C C C C C C C C H H H H H H H H H H H H H H H H
charge: -0.067459 -0.320677 0.395446 -0.545318 0.173177 0.400364 -0.478378 -0.445411 -0.390653 0.443303 -0.449727 -0.245081 -0.433198 -0.265671 -0.242288 -0.423743 -0.374252 -0.210672 -0.210684 -0.103153 0.231480 0.186113 0.281237 0.226816 0.195357 0.237717 0.245545 0.239617 0.228490 0.238285 0.227632 0.229816 0.237504 0.280986 0.253694 0.253785
chargesum: 0.00000
title: Mulliken charges with hydrogens summed into heavy atoms:
elementType: Cl N C C C C C C C C C C C C C C C C C C
charge: -0.067459 -0.039441 0.395446 -0.127725 0.173177 0.400364 -0.056205 -0.207694 -0.145107 0.443303 -0.210110 -0.016591 -0.194913 -0.038038 -0.012472 -0.186239 -0.093267 0.043022 0.043101 -0.103153
polarizability: 2.54211064e+02 -8.53301069e+00 2.15006316e+02 -1.60320536e+01 1.72342466e+01 1.61420496e+02
1716.lowfreq: -5.9896 -1.5843 -0.0013 -0.0009 -0.0009 4.4837 15.6511 23.1992 30.1366
frequency: 15.2791 23.1220 30.0989 50.9470 85.8013 124.1514 127.1247 170.9947 179.7475 214.0159 241.9011 287.6457 293.0202 325.2009 368.8877 410.1942 411.9660 430.6889 451.8877 471.9313 492.9066 498.0910 509.9492 554.0465 600.1523 624.1531 642.8963 653.3224 667.0039 706.2774 711.8650 745.0125 784.0808 788.8565 802.5194 814.1746 823.6552 838.8556 866.3496 877.8071 920.1511 941.0708 958.2990 961.2633 975.4920 982.3652 985.1170 992.9514 999.7642 1022.6065 1046.4771 1069.6191 1072.1273 1086.5500 1100.2368 1127.5709 1150.7794 1173.0454 1174.8721 1179.9126 1184.5160 1210.5748 1235.7747 1240.4291 1249.9153 1275.0819 1284.3069 1311.3019 1365.5162 1379.0546 1385.4751 1399.2545 1408.2313 1418.9942 1443.0744 1444.0446 1456.8081 1472.5951 1481.6395 1502.3489 1518.2399 1588.0547 1590.9947 1601.5336 1602.2654 1633.8917 2847.6517 2854.0732 2964.6797 3005.2790 3120.9131 3122.5005 3125.2543 3127.5148 3131.7368 3143.6008 3149.4275 3157.6201 3162.0941 3167.5198 3171.2367 3447.2779
redmass: 6.4933 3.7978 6.0086 5.0997 5.2015 2.4264 4.8606 4.7904 4.6542 5.8765 4.9290 3.0605 4.3662 3.7726 5.6905 3.4931 3.1079 3.1434 3.6343 3.2450 5.0373 3.3255 5.2736 4.3811 3.7772 5.7966 3.8757 3.3312 1.6144 4.0386 3.6539 1.3163 3.5167 2.3971 2.7560 1.5721 1.6709 1.2822 2.6037 2.1869 1.4523 1.4020 1.4056 1.5702 1.8647 1.4845 1.3833 1.3651 4.2311 2.9236 2.5737 2.6746 2.5868 2.0091 1.4654 3.6933 1.4277 1.1174 1.1193 1.1269 1.1605 2.5907 1.5877 1.4629 1.6540 1.6739 1.3043 1.4344 2.1782 2.1492 3.9194 2.1406 2.8749 4.9835 2.4360 1.2081 2.5844 1.8421 1.2936 1.1510 3.2448 7.4966 7.3021 5.5014 6.2967 6.5766 1.0719 1.0718 1.0851 1.0864 1.0855 1.0860 1.0897 1.0881 1.0919 1.0948 1.0886 1.0992 1.1004 1.0953 1.0968 1.0751
irintensity: 0.0971 0.1246 0.1730 0.9877 0.9172 2.5206 0.8587 1.8643 1.0381 0.1915 1.0656 2.8142 0.6634 2.0857 9.3662 3.3890 3.2469 0.7437 8.5834 0.5250 10.8980 18.1903 2.2608 17.0941 0.1245 5.5970 9.6239 23.9310 73.4212 3.2460 5.8622 2.1338 24.3033 52.4397 24.1430 55.0557 42.5158 13.3428 2.1828 6.3114 0.3961 8.5701 0.1446 5.1331 3.8847 2.6323 0.7728 1.5466 49.9241 8.2200 5.8604 27.7536 3.6089 10.2116 11.8400 52.7524 1.6025 17.6656 0.4010 1.2957 14.3992 2.2747 2.4319 8.8257 1.1680 3.4946 8.2647 13.3730 6.0316 6.8278 3.7964 5.0335 4.3011 3.8351 7.6928 64.7499 0.2433 86.1043 9.0724 6.4957 9.4725 2.9141 0.1194 5.3453 4.6436 0.2071 37.1841 153.4875 27.9866 32.8764 3.2074 0.0480 11.7225 1.5228 20.1720 39.8872 0.4341 40.2591 22.3696 7.6054 1.7353 0.2038
temp: 298.150 k
press: 1.00000 atm
elementType: 17 7 6 6 6 6 6 6 6 6 6 6 6 6 6 6 6 6 6 6 1 1 1 1 1 1 1 1 1 1 1 1 1 1 1 1
symmnumber: 1
zpe: 753761.9 jmol-1
zpe.correction: 0.287093 hartree
zpe.thermalcorrener: 0.304104 hartree
zpe.thermalcorrenthalpy: 0.305048 hartree
zpe.thermalcorrgfe: 0.239084 hartree
zpe.sumelectzpe: -1208.930213 hartree
zpe.sumelectthermal: -1208.913202 hartree
zpe.sumelectthermalent: -1208.912258 hartree
zpe.sumelectthermalfe: -1208.978222 hartree
dipole: 2.8033 0.3203 1.5245
dipole: 3.2070
quadrupole: -136.0897 -114.7888 -119.5979
quadrupole: -0.1823 -12.4310 4.0791
quadrupole: -12.5976 8.7033 3.8942 -0.1823 -12.4310 4.0791
hfenergy: -1209.217306 hartree
pointgroup: C01 [X(C18H16Cl1N1)]
dipole: -1.0909609 -0.1125774 0.6238128 debye
polarizability: 253.6557145|-12.7836933|219.325724|10.9257552|-12.1477821|157.6564377 unknown
InChI: InChI=1S/C18H16ClN/c19-17-10-8-14(9-11-17)12-20-13-16-6-3-5-15-4-1-2-7-18(15)16/h1-11,20H,12-13H2
charge 0 multiplicity 1
36 atoms
Cl 6.771458 -0.714017 -1.694638
N  0.477021 0.544293 0.78476
C  -1.936904 1.124273 0.663737
C  -0.72036 0.957133 1.56092
C  -2.678362 -0.027428 0.198754
C  -3.81725 0.171735 -0.678656
C  1.646088 0.199403 1.617698
C  -2.339305 2.403808 0.263287
C  -2.333323 -1.373182 0.567856
C  2.895349 -0.047108 0.780181
C  -4.189778 1.50279 -1.059986
C  -3.464409 2.600117 -0.59583
C  -4.552667 -0.968103 -1.146243
C  -3.0683 -2.46355 0.096702
C  -4.187734 -2.261905 -0.771049
C  3.852369 -1.011238 1.18265
C  3.136687 0.703904 -0.398214
C  5.037001 -1.219686 0.439927
C  4.311763 0.507081 -1.156867
C  5.246629 -0.451934 -0.721038
H  -0.490674 1.923358 2.049419
H  -0.954093 0.236654 2.385614
H  0.258854 -0.183485 0.090559
H  1.823681 1.059984 2.297182
H  1.471302 -0.682781 2.285071
H  -1.771825 3.274506 0.611846
H  -1.486663 -1.547902 1.241383
H  -5.052893 1.643391 -1.721595
H  -3.750236 3.616523 -0.887245
H  -5.41198 -0.804218 -1.807763
H  -2.79052 -3.481388 0.392191
H  -4.755336 -3.125214 -1.135027
H  3.678104 -1.610249 2.084829
H  2.386757 1.436259 -0.714151
H  5.773918 -1.964869 0.753303
H  4.496728 1.087544 -2.065567
