program: Gaussian 09
title: 000086873
version: EM64L-G09RevD.01
frameworkgroup: C1[X(C6H13NO)]
method: RPBEPBE
basis: SDD
operation: Freq
keyword: #p
keyword: freq=noraman
keyword: PBEPBE/SDD
title: #p freq=noraman PBEPBE/SDD
converged: YES YES NO NO
title: Mulliken charges:
elementType: O N C C C C C C H H H H H H H H H H H H H
charge: -0.438743 -0.270030 -0.090937 -0.473999 -0.423330 -0.464537 -0.443752 -0.323971 0.216006 0.221105 0.212837 0.214312 0.221605 0.224705 0.221230 0.234247 0.179569 0.229380 0.213704 0.212906 0.327694
chargesum: 0.00000
title: Mulliken charges with hydrogens summed into heavy atoms:
elementType: O N C C C C C C
charge: -0.111049 -0.035783 0.125069 -0.040058 0.012587 -0.018601 -0.034803 0.102639
polarizability: 8.70807699e+01 -1.54588110e+00 6.78360599e+01 1.59768955e+00 2.44184392e-01 6.49145334e+01
1716.lowfreq: -6.5912 -0.0009 -0.0005 -0.0004 7.7900 15.2398 54.9164 81.0353 97.5225
frequency: 53.8249 81.0142 97.4409 130.1619 206.6353 304.3035 326.5984 351.2588 466.5601 611.2984 656.7844 738.5100 782.5532 795.8436 848.2832 886.4220 916.9347 939.7030 965.5389 1000.1194 1026.9334 1046.8668 1058.7301 1096.0173 1107.1271 1124.1984 1178.1021 1213.4676 1242.6705 1247.8399 1275.4858 1283.8107 1289.0317 1307.9471 1318.2346 1331.1248 1357.0894 1378.4959 1419.0230 1456.2024 1464.3585 1472.2504 1480.5926 1484.6529 2941.2550 2962.5193 2985.8933 2987.6184 2998.5750 3013.6674 3034.7860 3049.8843 3066.2261 3079.4437 3084.3010 3370.2606 3558.2082
redmass: 1.8992 2.4318 2.3710 3.0521 2.2141 1.1905 4.2275 3.2932 1.9261 2.7374 2.8743 2.0433 1.3202 1.1448 1.8540 3.2528 2.9070 1.4829 2.3144 3.5125 1.7993 3.1014 1.8947 2.5894 1.4469 1.8149 1.3066 1.2533 1.4157 1.2611 1.2724 1.3478 1.2213 1.2014 1.3179 1.2740 1.4489 1.2827 1.1579 1.0840 1.0866 1.0843 1.0862 1.0937 1.0689 1.0812 1.0617 1.0657 1.0624 1.0642 1.0915 1.1014 1.1021 1.1021 1.1054 1.0741 1.0662
irintensity: 0.3334 4.5804 3.3744 0.6646 10.5343 109.0365 33.1160 13.4697 10.2411 1.2226 5.1048 100.4355 5.2004 24.4731 5.2339 13.7140 41.2122 15.9657 40.8215 17.5428 6.9034 17.8299 3.0166 7.6847 43.4243 0.3826 2.3111 1.6590 17.8930 3.4394 5.6037 0.8161 1.8351 2.9785 11.9480 1.0034 1.5072 19.4848 15.3948 0.8417 3.8836 7.7066 6.6868 7.2763 16.0205 36.9402 22.0591 58.4915 55.3515 55.7131 17.5846 17.7194 12.1608 31.7112 95.3652 5.5372 6.6060
temp: 298.150 k
press: 1.00000 atm
elementType: 8 7 6 6 6 6 6 6 1 1 1 1 1 1 1 1 1 1 1 1 1
symmnumber: 1
zpe: 490185.9 jmol-1
zpe.correction: 0.186702 hartree
zpe.thermalcorrener: 0.195705 hartree
zpe.thermalcorrenthalpy: 0.196649 hartree
zpe.thermalcorrgfe: 0.152168 hartree
zpe.sumelectzpe: -365.715711 hartree
zpe.sumelectthermal: -365.706707 hartree
zpe.sumelectthermalent: -365.705763 hartree
zpe.sumelectthermalfe: -365.750244 hartree
dipole: 2.4469 0.7580 -1.8224
dipole: 3.1437
quadrupole: -58.8324 -53.3797 -45.2491
quadrupole: 0.3051 4.9662 1.5146
quadrupole: -6.3454 -0.8926 7.2380 0.3051 4.9662 1.5146
hfenergy: -365.9024126 hartree
pointgroup: C01 [X(C6H13N1O1)]
dipole: 0.9677924 -0.3045693 0.7073749 debye
dipolederiv: -0.957797 0.0599915 0.1585964 0.03149 -0.5743197 0.0544423 0.2122425 0.0552821 -0.1664188 -0.6250969 0.0938424 0.0666348 0.1277957 -0.6824079 -0.1346967 -0.0424001 0.0292755 -0.0916468 0.2654663 0.010176 0.0337306 0.0251604 0.3971596 0.0523373 0.1252599 0.1119068 0.2638309 -0.1355988 0.0977136 -0.0401984 -0.0219449 -0.0497931 0.0261352 -0.0853955 0.0018472 0.1305123 -0.0665821 -0.026042 -0.0031139 0.0634449 -0.1185723 0.0063199 0.0288545 0.032605 0.145721 0.4045449 -0.0283808 -0.0490869 -0.0228119 0.2820649 -0.0071307 -0.1405132 -0.0860254 0.2437587 -0.1926442 0.0244143 0.0282611 0.0898145 -0.0060333 0.0387345 -0.0216048 0.0393843 0.1568009 0.7111337 0.0408797 -0.1183037 -0.0123701 0.354471 -0.0227172 -0.1100027 -0.0244758 0.3003276 0.0350304 0.0033431 -0.0021887 -0.0210654 -0.0040689 0.0294904 -0.021298 -0.0058614 -0.1877514 0.0717874 -0.0002826 0.0005249 -0.0115197 -0.1139588 -0.106721 0.0089181 -0.142285 -0.0106261 0.032077 -0.0466788 0.0596459 -0.0314519 0.0247813 0.0500494 0.0440959 0.1142633 -0.1296244 -0.0442935 0.0351138 -0.0883201 0.0241817 0.0442098 0.0361659 -0.1551036 0.0504296 -0.0837823 -0.0518565 0.0354182 0.0929385 0.0585825 0.0437771 -0.0322397 0.1572026 -0.052219 -0.0664245 -0.0311466 -0.0808482 -0.0527465 -0.0757544 -0.0353702 -0.0765996 -0.0993716 -0.1223876 -0.0109202 0.0098158 -0.0013313 0.0319364 0.0079687 0.0045896 0.0637955 0.1105804 0.1139341 -0.136008 0.1432976 -0.0697146 -0.0059845 -0.099746 0.2172159 0.1295673 0.0504994 -0.0219611 -0.0802815 0.0310821 0.0012978 -0.0297419 0.0316801 0.0637183 -0.0107335 0.0120219 0.0321354 -0.2044117 0.0460773 -0.041299 -0.0115367 -0.0379924 -0.1221594 -0.0473183 -0.0271381 -0.0624368 0.0581047 -0.0019394 -0.0609868 0.0119547 -0.0549732 -0.1547767 -0.0344231 -0.0110114 -0.0848934 0.0413748 0.0337411 -0.004817 0.0105443 -0.0022813 0.0780872 -0.0053103 0.0071701 0.0310485 -0.1465131 0.3229016 -0.0418093 -0.0935465 -0.0682075 0.3513857 -0.0091476 -0.0430062 -0.0095666 -0.0260221 unknown
polarizability: 87.0641402|1.4565544|67.8201227|-1.7985531|0.245005|64.9471003 unknown
InChI: InChI=1S/C6H13NO/c8-5-3-6-2-1-4-7-6/h6-8H,1-5H2
charge 0 multiplicity 1
21 atoms
O  -3.623002 0.001314 0.144858
N  0.709388 1.069393 0.23105
C  0.216485 -0.233565 -0.3211
C  1.326341 -1.274964 0.035513
C  2.651384 -0.448589 0.030992
C  2.179828 1.053662 -0.033331
C  -1.190484 -0.590494 0.186057
C  -2.270124 0.405221 -0.280858
H  0.1813 -0.11983 -1.425597
H  1.349269 -2.118339 -0.677409
H  1.124293 -1.692688 1.041358
H  3.247513 -0.647884 0.939181
H  3.283426 -0.700301 -0.83947
H  2.705611 1.704642 0.686022
H  2.3586 1.460341 -1.045974
H  0.531142 1.095876 1.250058
H  -1.175642 -0.636445 1.298296
H  -1.465604 -1.601646 -0.169498
H  -2.025888 1.42962 0.065323
H  -2.326461 0.419552 -1.382517
H  -3.659973 0.009125 1.134845
