program: Gaussian 09
title: 000086915
version: EM64L-G09RevD.01
frameworkgroup: C1[X(C10H17N2O2PS)]
method: RPBEPBE
basis: SDD
operation: Freq
keyword: #p
keyword: freq=noraman
keyword: PBEPBE/SDD
title: #p freq=noraman PBEPBE/SDD
converged: YES YES NO NO
title: Mulliken charges:
elementType: S P O O N N C C C C C C C C C C H H H H H H H H H H H H H H H H H
charge: 0.184713 1.362216 -0.553612 -0.620535 -0.455687 -0.952041 0.376463 0.550128 -0.595983 -0.399567 -0.391352 -0.568146 -0.575919 -0.126796 -0.817225 -0.862724 0.254182 0.302775 0.223237 0.227654 0.258300 0.221970 0.274791 0.222649 0.237454 0.369896 0.352712 0.243224 0.240849 0.226467 0.265974 0.259184 0.264749
chargesum: 0.00000
title: Mulliken charges with hydrogens summed into heavy atoms:
elementType: S P O O N N C C C C C C C C C C
charge: 0.184713 1.362216 -0.553612 -0.620535 -0.455687 -0.229433 0.376463 0.550128 -0.341801 -0.399567 -0.088576 0.141044 0.143491 0.110657 -0.106684 -0.072818
polarizability: 2.36960778e+02 9.81805962e+00 1.66290803e+02 -1.04314357e+01 1.24745831e+00 1.18250502e+02
1716.lowfreq: -3.8580 0.0008 0.0011 0.0026 2.9107 10.0824 20.6517 27.2195 47.0880
frequency: 20.3796 27.0646 47.0660 62.9587 86.2436 96.2238 138.5369 150.8719 167.6123 186.8162 191.9823 199.1913 209.6786 222.0542 228.2003 236.0845 252.9030 268.7203 300.9926 332.7425 340.4757 371.0093 385.9439 399.0479 431.3098 443.5196 475.2065 491.8440 528.4877 559.0458 587.0399 626.9772 666.2697 682.2394 715.0953 740.9094 822.7538 840.0771 887.4648 935.0505 952.5432 966.7678 966.9099 979.1768 991.6743 1002.3230 1033.1456 1042.4592 1046.1800 1064.5103 1094.9048 1136.1066 1142.0509 1168.2918 1207.0204 1226.4914 1273.4614 1278.4460 1347.3436 1362.7238 1399.9565 1412.0348 1422.6465 1436.5524 1454.8264 1455.0545 1463.8400 1468.3899 1469.3889 1476.1602 1481.1073 1481.2599 1496.3199 1559.3261 1572.0842 1607.7548 2949.2193 2954.4270 2970.0042 3006.4979 3028.8992 3032.7901 3043.8323 3088.0377 3098.4014 3100.4590 3123.6166 3132.7198 3148.4528 3150.0405 3168.1811 3551.1362 3699.2680
redmass: 4.1738 3.9363 3.3150 3.2433 4.4225 4.6839 2.6099 1.0865 2.9415 1.4148 1.6677 1.9999 3.6200 3.0302 2.2257 1.1996 3.0946 3.6680 3.5656 2.5896 4.3656 2.7562 4.3773 3.1810 3.8826 2.9167 3.9129 1.5313 5.1371 5.1944 4.3675 5.2907 6.9552 7.6568 3.4699 7.3129 1.3584 5.8700 1.4223 3.2325 1.3533 2.4041 1.1903 1.4848 1.3063 1.5604 6.7263 7.4188 1.5283 1.3651 1.2189 1.3667 1.5993 1.6888 6.2764 2.5346 1.5590 2.2219 1.1379 7.8711 1.2799 2.5738 1.1265 1.1425 1.7846 1.0574 1.0438 1.2185 1.0534 1.0496 1.2341 1.0480 1.0589 1.1062 6.9018 6.3873 1.0372 1.0371 1.0376 1.0290 1.0992 1.1004 1.0970 1.0985 1.0972 1.0983 1.1061 1.1020 1.0905 1.0892 1.0966 1.0445 1.1023
irintensity: 2.5863 1.0650 2.3581 1.3930 1.9046 1.4804 5.5771 0.9408 2.4327 2.2214 0.6607 1.8300 2.3334 1.8233 1.0211 0.8533 5.1065 3.3629 8.1858 10.0785 6.3665 63.3556 7.8641 17.7452 3.2614 8.1942 51.5916 225.6444 24.1216 14.4655 11.1550 30.8761 67.8349 77.6771 0.6376 113.5695 27.6379 185.5088 19.5549 117.2207 5.4028 103.9954 14.8364 199.6356 4.0061 31.8327 32.4361 96.7985 10.7733 12.6313 0.6210 13.7182 65.6322 67.2471 46.0808 49.0499 37.9029 16.4742 0.6131 5.0952 14.9897 29.5255 13.9569 1.3963 125.7340 14.9573 16.4119 13.1555 9.1424 25.9834 106.6858 19.8040 7.1882 80.9540 22.4912 27.3536 40.8789 103.9996 24.4648 27.2878 80.6258 21.5150 15.7442 21.3862 6.0540 5.4254 18.3006 8.9278 13.4397 1.6820 2.9771 62.4676 49.9327
temp: 298.150 k
press: 1.00000 atm
elementType: 16 15 8 8 7 7 6 6 6 6 6 6 6 6 6 6 1 1 1 1 1 1 1 1 1 1 1 1 1 1 1 1 1
symmnumber: 1
zpe: 685109.2 jmol-1
zpe.correction: 0.260944 hartree
zpe.thermalcorrener: 0.280564 hartree
zpe.thermalcorrenthalpy: 0.281508 hartree
zpe.thermalcorrgfe: 0.211940 hartree
zpe.sumelectzpe: -1389.251987 hartree
zpe.sumelectthermal: -1389.232368 hartree
zpe.sumelectthermalent: -1389.231424 hartree
zpe.sumelectthermalfe: -1389.300992 hartree
dipole: 1.6534 1.7169 1.5595
dipole: 2.8484
quadrupole: -93.9167 -109.1502 -108.4702
quadrupole: 15.3218 0.6713 -3.3782
quadrupole: 9.9290 -5.3045 -4.6244 15.3218 0.6713 -3.3782
hfenergy: -1389.5129317 hartree
pointgroup: C01 [X(C10H17N2O2P1S1)]
dipole: 0.6228839 -0.2282423 -0.9032152 debye
polarizability: 233.2799754|-22.6517957|151.0896872|3.8466796|23.3560538|137.1324205 unknown
InChI: InChI=1S/C10H17N2O2PS/c1-8-7-9(5-6-10(8)16-4)14-15(11,13)12(2)3/h5-7H,11H2,1-4H3
charge 0 multiplicity 1
33 atoms
S  -4.371736 0.917346 -0.269381
P  2.796302 -0.086575 0.5448
O  1.33387 -1.082471 0.336801
O  2.665391 1.069683 1.640012
N  3.335364 0.553177 -0.968928
N  3.773263 -1.469186 0.811257
C  0.03305 -0.522995 0.229621
C  -2.185991 -0.731603 -0.813041
C  -0.848788 -1.164719 -0.668437
C  -2.623684 0.385301 -0.037124
C  -0.401986 0.574527 1.00371
C  3.551885 -0.317801 -2.136525
C  3.208739 1.998704 -1.233603
C  -1.732893 1.02346 0.85516
C  -3.124637 -1.436926 -1.773079
C  -4.507329 2.372218 0.906951
H  -0.4805 -2.015664 -1.251098
H  0.283718 1.064014 1.702076
H  4.474672 -0.006844 -2.662914
H  2.704384 -0.262989 -2.85047
H  3.673487 -1.362335 -1.806237
H  4.142888 2.370976 -1.695961
H  3.048291 2.528835 -0.280548
H  2.362933 2.218054 -1.916906
H  -2.059663 1.876002 1.457912
H  3.327235 -2.319639 1.151483
H  4.775278 -1.366665 0.956426
H  -4.001238 -1.854988 -1.241487
H  -3.51998 -0.737962 -2.535349
H  -2.61445 -2.263094 -2.295946
H  -4.33271 2.052595 1.946112
H  -5.54226 2.732723 0.801692
H  -3.807502 3.17284 0.620818
