program: Gaussian 09
title: 000086854
version: EM64L-G09RevD.01
frameworkgroup: C1[X(C10H13N)]
method: RPBEPBE
basis: SDD
operation: Freq
keyword: #pfreq=noraman
keyword: PBEPBE/SDD
title: #p freq=noraman PBEPBE/SDD
converged: YES YES NO NO
title: Mulliken charges:
elementType: N C C C C C C C C C C H H H H H H H H H H H H H
charge: -0.414263 -0.200877 -0.428312 0.377565 -0.421254 0.252285 -0.713476 -0.420710 -0.423396 -0.281327 -0.216172 0.222776 0.227850 0.197477 0.210325 0.213303 0.286192 0.223482 0.228617 0.207689 0.224721 0.209097 0.220443 0.217963
chargesum: 0.00000
title: Mulliken charges with hydrogens summed into heavy atoms:
elementType: N C C C C C C C C C C
charge: -0.128070 0.021899 -0.002985 0.377565 0.002374 0.252285 -0.053687 -0.195989 -0.214299 -0.060884 0.001792
polarizability: 1.45213923e+02 5.51249254e+00 1.18024174e+02 -7.37577239e-01 5.79047067e+00 6.78003304e+01
1716.lowfreq: -11.6771 -0.0009 -0.0004 -0.0004 6.9327 8.9964 65.7111 125.1308 193.0826
frequency: 65.6664 125.1290 193.0773 226.4008 249.3567 306.9481 344.2253 366.0688 389.2336 468.1963 479.9474 499.9911 555.0343 589.8749 651.2604 705.3883 740.1258 747.4608 820.4074 839.0497 840.8608 894.3863 928.0189 958.8397 962.7703 979.7418 1003.4364 1034.0001 1069.4117 1115.9448 1123.5514 1128.4856 1168.2573 1192.2914 1197.5902 1232.3826 1256.5305 1293.7029 1302.5624 1324.3542 1347.5668 1352.1510 1383.2700 1387.7263 1429.5025 1456.6972 1468.7594 1473.6133 1485.4637 1493.2999 1514.9873 1591.5100 1622.0688 2920.5302 2972.3038 2976.7315 2996.8984 3023.3789 3056.5579 3068.6621 3079.9621 3103.8937 3107.3264 3133.2985 3159.2746 3575.1598
redmass: 3.0331 3.4371 1.9030 1.4910 2.1765 2.7863 2.3169 1.7480 1.6415 4.4700 3.1711 3.6675 3.7862 4.4695 2.3401 4.1946 1.9003 1.8354 3.3670 1.6751 2.0211 2.2414 1.3770 1.3902 1.5204 2.1826 1.5440 2.3042 2.2706 2.0381 1.5987 1.8977 1.0680 1.5031 1.5514 1.3781 1.4928 2.1284 1.3174 1.5563 1.4238 1.3997 1.2330 4.0344 2.0965 1.0890 1.0627 1.1845 1.4796 1.5128 2.0392 5.8050 6.3459 1.0704 1.0372 1.0778 1.0664 1.0892 1.1037 1.0992 1.0993 1.0867 1.0889 1.0920 1.0997 1.0771
irintensity: 1.0092 5.0335 0.7903 0.2018 6.1527 0.5603 21.4663 54.6272 36.2568 2.7954 4.2470 2.5247 0.1782 1.1634 0.3507 1.2225 34.8709 65.9203 11.7229 0.3203 3.1373 0.1058 2.0197 0.5431 0.5211 4.5537 3.3467 5.5758 24.8661 1.1160 10.8852 2.9803 2.8076 4.6311 10.4415 6.1782 2.3282 34.8349 1.3581 12.5355 32.4695 36.5872 13.6857 18.3037 5.0877 15.2543 12.7610 10.7214 12.5530 28.5616 117.4730 9.0417 100.1163 102.9553 41.3883 12.8346 41.7521 72.5929 39.3494 56.4121 27.9203 27.4315 3.9594 31.6279 30.5936 21.3344
temp: 298.150 k
press: 1.00000 atm
elementType: 7 6 6 6 6 6 6 6 6 6 6 1 1 1 1 1 1 1 1 1 1 1 1 1
symmnumber: 1
zpe: 541612.6 jmol-1
zpe.correction: 0.206289 hartree
zpe.thermalcorrener: 0.215931 hartree
zpe.thermalcorrenthalpy: 0.216875 hartree
zpe.thermalcorrgfe: 0.171802 hartree
zpe.sumelectzpe: -442.805817 hartree
zpe.sumelectthermal: -442.796175 hartree
zpe.sumelectthermalent: -442.795231 hartree
zpe.sumelectthermalfe: -442.840304 hartree
dipole: 1.9826 1.1238 0.1881
dipole: 2.2867
quadrupole: -62.3130 -58.1006 -70.3371
quadrupole: 0.8129 -0.7801 2.5293
quadrupole: 1.2705 5.4830 -6.7535 0.8129 -0.7801 2.5293
hfenergy: -443.0121063 hartree
pointgroup: C01 [X(C10H13N1)]
dipole: -0.7849734 0.430751 -0.0873757 debye
dipolederiv: -1.0770208 0.4612904 -0.0844515 0.5892455 -0.5593475 -0.036614 0.054984 -0.1144244 -0.4723323 0.1106166 0.0557305 -0.0086892 -0.0077349 0.1126044 0.0016793 -0.0657397 -0.0338229 0.1783634 0.0452175 0.0275281 0.0030299 -0.0273892 0.0030129 0.0216889 -0.0007198 0.0187334 0.066921 0.0024461 0.0337452 0.0189956 0.5561221 -0.2008195 -0.0265176 -0.0749573 -0.0170285 -0.1466607 0.7502738 -0.0460779 0.0913419 0.1984715 0.099094 0.1022719 0.0036243 0.1203919 0.3150812 0.8048218 -0.6670027 0.0514013 -0.9025805 0.4992149 -0.0292113 0.0965927 -0.0316712 0.0962721 0.002026 -0.0179317 -0.0211258 0.0017152 0.0218349 -0.0775771 0.0160531 -0.0412031 -0.0285271 0.2482412 0.0288301 -0.0133251 -0.1062493 0.1117029 -0.0435264 -0.0021288 -0.0428806 -0.1374549 -0.3307022 0.3512534 -0.0486217 -0.0492265 0.0300019 -0.0435519 0.0065644 -0.0536575 -0.2159438 -0.2362264 -0.082955 0.0117284 -0.1241865 -0.1934726 -0.0158774 0.0233315 -0.0036337 -0.2253585 0.0982094 -0.1080461 -0.0018362 0.0738852 0.2243313 -0.0645857 -0.0238318 -0.066316 -0.1344975 0.011021 0.0137805 -0.0136597 -0.0226962 -0.08273 0.1101429 0.0196521 0.1012879 -0.0765248 0.0963658 0.0021853 -0.0636434 0.0159038 0.0003858 -0.0722236 -0.0130022 -0.0489959 -0.1501222 -0.2101389 -0.0642206 0.0245091 -0.0914439 0.0513787 0.0167004 -0.0168039 0.0091974 0.0842941 -0.1333236 0.0164256 -0.0594097 -0.1368371 0.0858982 -0.0607968 -0.1677992 -0.0119687 -0.1824662 -0.089207 0.1038429 0.0261021 0.1345259 -0.1057629 -0.0549891 0.0569632 -0.0816094 0.0631235 0.062884 -0.0511279 0.0254643 -0.055669 0.1428908 0.0501086 0.0088291 0.0901229 0.3056604 0.0830568 -0.0118077 -0.0151172 0.0189379 -0.0170429 0.1480743 -0.0089192 0.0808048 -0.0467977 0.0136623 0.1403093 0.049589 0.0913142 -0.0423847 -0.0745926 0.0327803 -0.0329609 0.055658 -0.1956202 -0.1540238 -0.0047034 -0.1147916 0.0328106 -0.0092114 0.0130953 -0.0031401 0.0581097 0.0827394 -0.0672213 0.0203293 -0.0324845 -0.1210916 0.0496074 0.0133394 0.0510463 0.1215476 0.0633433 0.0095274 0.0005356 -0.0384987 -0.1513436 0.0572464 0.0108559 0.0601098 0.1521311 -0.0724376 0.1032219 -0.0127292 0.1163362 -0.0026997 0.03106 -0.0104745 0.0328787 0.1700431 -0.1302485 -0.0772559 0.0242858 -0.0866695 0.0615339 0.0206948 0.0277109 0.0187398 0.1494806 unknown
polarizability: 145.3645558|-5.0550047|117.7963773|0.4101197|-6.2031793|67.8774946 unknown
InChI: InChI=1S/C10H13N/c1-8-6-7-11-10-5-3-2-4-9(8)10/h2-5,8,11H,6-7H2,1H3
charge 0 multiplicity 1
24 atoms
N  -0.772184 1.731365 -0.185909
C  -1.339768 -1.084698 0.320799
C  -2.304428 0.049206 0.761195
C  0.085163 -0.544225 0.185392
C  -2.169606 1.285534 -0.154249
C  0.306218 0.845288 -0.081381
C  -1.816805 -1.77053 -0.990533
C  1.203469 -1.398377 0.309264
C  1.641674 1.324953 -0.222021
C  2.527759 -0.926203 0.165643
C  2.736852 0.448192 -0.10278
H  -1.340119 -1.859293 1.114185
H  -2.072621 0.350187 1.800556
H  -3.351015 -0.308884 0.736781
H  -2.54156 1.036808 -1.173276
H  -2.800085 2.10967 0.22971
H  -0.572989 2.700779 -0.427092
H  -1.850192 -1.053095 -1.830541
H  -1.126568 -2.582657 -1.28054
H  -2.827868 -2.202787 -0.862137
H  1.028062 -2.460755 0.526448
H  1.812683 2.390859 -0.423276
H  3.37667 -1.610529 0.265058
H  3.754957 0.838792 -0.216095
