program: Gaussian 09
title: 000090501
version: EM64L-G09RevD.01
frameworkgroup: C1[X(C7H8N2)]
method: RPBEPBE
basis: SDD
operation: Freq
keyword: #p
keyword: freq=noraman
keyword: PBEPBE/SDD
title: #p freq=noraman PBEPBE/SDD
converged: YES YES NO NO
title: Mulliken charges:
elementType: N N C C C C C C C H H H H H H H H
charge: -0.158326 -0.021393 0.427729 -0.430451 -0.235773 -0.561988 -0.274426 -0.622707 -0.122082 0.249016 0.246568 0.257368 0.272466 0.244742 0.232444 0.265977 0.230835
chargesum: 0.00000
title: Mulliken charges with hydrogens summed into heavy atoms:
elementType: N N C C C C C C C
charge: -0.158326 -0.021393 0.427729 -0.181436 0.010796 -0.032154 -0.029684 0.106550 -0.122082
polarizability: 1.01063403e+02 -4.91940004e+00 8.30085271e+01 -2.81707488e+00 -2.99896935e+00 5.44455112e+01
1716.lowfreq: -8.2038 -7.8989 -0.0003 0.0004 0.0005 10.5123 48.8137 85.2366 98.8607
frequency: 48.7622 85.2312 98.8590 197.7485 252.1641 269.7250 356.9313 401.7213 457.4842 607.5625 616.1193 673.9559 715.3259 737.9521 791.8803 864.5576 875.5089 907.7644 917.4657 1006.5890 1054.9071 1088.3811 1117.2085 1164.0849 1196.8541 1245.3055 1289.7263 1319.5247 1372.3154 1420.0680 1435.6010 1447.5256 1472.2170 1490.1961 1496.2217 1550.5536 2193.7530 2970.3659 2989.3964 3057.1862 3071.3579 3110.5380 3205.2384 3216.7228 3240.6219
redmass: 2.7164 1.3326 5.7475 2.8017 2.6773 5.5961 3.1047 2.7778 8.5901 3.2609 3.7843 4.5965 1.2295 3.4281 1.4764 1.3643 4.2069 2.5544 3.2623 1.4864 1.5542 1.2500 1.3147 1.7092 1.8060 1.2703 1.5931 3.0342 4.4104 2.0710 1.2211 1.8172 1.0427 1.1734 2.3235 5.3929 12.4188 1.0664 1.0349 1.0918 1.1020 1.0997 1.0914 1.0959 1.1092
irintensity: 5.7368 0.6598 4.6822 1.5298 4.6485 6.7272 0.6981 0.7570 0.6063 3.7605 1.2047 3.6363 106.7527 14.3412 17.2188 1.2648 1.9119 4.5709 2.4360 8.0363 7.7567 24.1848 1.7183 1.1024 8.0819 0.8928 6.3581 30.4929 1.8110 7.3531 14.9857 5.7304 22.2631 27.7143 28.0156 0.4545 7.9586 16.7996 43.8303 1.7583 19.1640 14.1369 3.9333 3.3317 2.8948
temp: 298.150 k
press: 1.00000 atm
elementType: 7 7 6 6 6 6 6 6 6 1 1 1 1 1 1 1 1
symmnumber: 1
zpe: 353491.6 jmol-1
zpe.correction: 0.134638 hartree
zpe.thermalcorrener: 0.143409 hartree
zpe.thermalcorrenthalpy: 0.144353 hartree
zpe.thermalcorrgfe: 0.100305 hartree
zpe.sumelectzpe: -380.362865 hartree
zpe.sumelectthermal: -380.354093 hartree
zpe.sumelectthermalent: -380.353149 hartree
zpe.sumelectthermalfe: -380.397198 hartree
dipole: 1.8974 0.8532 2.5841
dipole: 3.3175
quadrupole: -64.0035 -44.4090 -56.0909
quadrupole: 3.1360 -8.5039 -0.4036
quadrupole: -9.1690 10.4255 -1.2564 3.1360 -8.5039 -0.4036
hfenergy: -380.4975027 hartree
pointgroup: C01 [X(C7H8N2)]
dipole: -0.8908224 -0.3891057 0.8709825 debye
dipolederiv: -0.119652 0.2342648 0.0090166 0.287402 -0.7482815 -0.0087101 0.0232235 0.0380327 -0.0945489 -0.3253372 -0.0012979 -0.0123068 0.0521637 -0.2465712 0.0013328 0.1225216 -0.0114106 -0.2061343 -0.0314623 0.0809008 0.0190743 -0.0640973 0.3807378 0.0255128 0.05493 0.079171 -0.1237337 -0.0654503 0.0705498 0.1088412 -0.0102179 -0.1311871 0.0333088 0.1095469 0.0381862 -0.205516 -0.0526543 -0.2811633 0.0640197 -0.1659202 0.1749055 -0.0088805 0.0471097 -0.0557638 -0.1914775 0.2946232 -0.0097901 0.0747613 0.0658225 0.1732717 -0.0685042 0.0072777 -0.0697511 0.187359 -0.0757755 -0.0033635 0.0916293 -0.0005406 -0.163958 0.0226303 0.0691283 0.0101335 -0.2024536 0.1695538 -0.1262461 -0.0260438 -0.1262795 0.4809167 0.0013566 -0.0222367 -0.0241785 0.1886568 -0.0091076 -0.0302916 -0.1267045 -0.0865015 -0.009738 0.0563435 -0.1834472 0.0443926 -0.0039729 0.1023886 -0.060847 -0.0597965 -0.04909 -0.0301626 -0.0570591 -0.0493013 -0.0643881 0.1653744 0.0675091 -0.0350391 -0.0683286 -0.0688869 0.0121408 -0.0633081 -0.0788214 -0.0500212 0.1745823 -0.0240336 0.0344273 -0.0045001 0.0763158 0.029748 0.1280403 -0.0326162 0.0679724 -0.0079617 0.0565341 -0.0079486 0.0161097 -0.0458589 -0.0064562 -0.0752951 0.0240492 -0.0264726 0.1105291 -0.0046757 0.0838382 -0.0714052 0.0861196 0.058405 0.0109708 -0.0791959 0.0115923 0.178899 -0.0441716 -0.1321734 -0.0477889 -0.03356 0.0098436 -0.0182196 -0.0421006 -0.0471191 0.1097268 -0.0063632 0.0973136 0.1035463 0.0341213 0.0084903 0.0137818 0.1116793 -0.0357208 0.009838 0.0680743 0.086866 -0.0701239 0.0490079 0.0078953 0.0066991 -0.0817469 0.0953449 -0.089167 unknown
polarizability: 97.5728013|-9.5285238|83.3284372|5.588358|7.8437639|57.6162026 unknown
InChI: InChI=1S/C7H8N2/c1-9-6-2-3-7(9)4-5-8/h2-3,6H,4H2,1H3
charge 0 multiplicity 1
17 atoms
N  -0.875772 -0.741906 -0.033383
N  3.075595 -0.604085 -0.66539
C  -0.163143 0.362008 0.461029
C  -0.969246 1.499678 0.306747
C  -2.118614 -0.302804 -0.498816
C  1.218252 0.245506 1.062366
C  -2.20403 1.080207 -0.297056
C  -0.385436 -2.12455 -0.107589
C  2.254695 -0.21659 0.109179
H  -0.693489 2.512663 0.597679
H  -2.832445 -1.001323 -0.9317
H  1.235726 -0.437396 1.936864
H  1.514747 1.24023 1.440349
H  -3.054209 1.71002 -0.552238
H  -1.220426 -2.787428 -0.384176
H  0.414899 -2.228132 -0.861869
H  0.007398 -2.457696 0.869705
