program: Gaussian 09
title: 000090496
version: EM64L-G09RevD.01
frameworkgroup: C1[X(C9H11N)]
method: RPBEPBE
basis: SDD
operation: Freq
keyword: #pfreq=noraman
keyword: PBEPBE/SDD
title: #p freq=noraman PBEPBE/SDD
converged: NO NO NO NO
title: Mulliken charges:
elementType: N C C C C C C C C C H H H H H H H H H H H
charge: -0.710357 -0.443286 -0.551920 -0.542799 0.342990 0.285002 -0.634731 -0.416758 0.529767 -0.438256 0.212450 0.219829 0.219539 0.221549 0.217061 0.219760 0.226851 0.230914 0.211178 0.299930 0.301287
chargesum: 0.00000
title: Mulliken charges with hydrogens summed into heavy atoms:
elementType: N C C C C C C C C C
charge: -0.109139 -0.011008 -0.110832 -0.105978 0.342990 0.285002 -0.407880 -0.185844 0.529767 -0.227078
polarizability: 1.40772459e+02 -2.32478241e+00 1.06468954e+02 -1.85931138e+00 -5.40094016e-01 5.53731419e+01
1716.lowfreq: -0.0010 -0.0007 -0.0005 8.7712 11.9633 18.0993 120.7820 163.3385 219.2641
frequency: 120.7809 163.3337 219.2617 287.9211 297.1124 313.2642 356.6507 416.0095 426.8982 460.9569 558.4594 571.5928 623.9584 702.6165 739.2564 761.6323 809.9625 847.8657 857.5190 887.1138 908.3528 927.9523 933.3750 1011.8471 1031.7853 1045.9364 1089.6010 1121.8734 1156.7473 1163.2316 1198.4506 1216.2059 1259.1911 1275.7751 1290.8522 1311.1261 1327.0086 1387.0872 1454.1604 1457.2510 1463.3816 1478.3995 1498.9578 1591.6301 1631.3962 1638.7405 2965.0706 2971.1688 2996.2820 3036.7814 3040.6918 3068.4688 3108.5271 3110.2546 3134.7371 3571.2387 3714.6560
redmass: 2.9281 2.2913 2.1308 3.2220 1.2939 2.8675 1.0508 3.3087 2.5360 4.6420 3.7672 2.8371 2.6434 2.4862 4.2976 3.5187 1.4722 1.9402 1.7544 1.5224 2.4782 2.5830 1.3933 2.1696 1.5271 1.6569 2.4694 1.2425 1.3738 1.2996 1.4870 1.5189 1.3000 1.7103 1.4512 1.6003 2.4461 5.6844 2.3274 1.1557 1.3141 1.1130 3.1717 7.0417 1.9345 2.0387 1.0651 1.0641 1.0650 1.0960 1.0946 1.1040 1.0893 1.0887 1.0966 1.0444 1.1043
irintensity: 5.0683 0.1397 10.2972 4.1036 202.1875 117.7476 0.0668 0.3819 4.6827 2.0648 1.3964 1.3569 2.4348 3.6852 0.2863 4.5065 41.6020 3.9136 33.5842 3.5403 5.1570 1.4078 0.0838 1.8060 0.1839 4.0123 10.0160 2.9487 5.6046 3.5173 0.3692 12.9171 1.6773 3.5502 10.7850 19.1943 24.7072 20.1675 3.9041 8.7218 10.3967 4.5287 104.4680 15.9705 1.0067 275.2906 55.2120 41.6277 38.4261 33.7048 44.1474 66.0317 9.7825 33.4682 28.2161 56.4178 18.2716
temp: 298.150 k
press: 1.00000 atm
elementType: 7 6 6 6 6 6 6 6 6 6 1 1 1 1 1 1 1 1 1 1 1
symmnumber: 1
zpe: 466605.6 jmol-1
zpe.correction: 0.177721 hartree
zpe.thermalcorrener: 0.186390 hartree
zpe.thermalcorrenthalpy: 0.187334 hartree
zpe.thermalcorrgfe: 0.144789 hartree
zpe.sumelectzpe: -403.588992 hartree
zpe.sumelectthermal: -403.580323 hartree
zpe.sumelectthermalent: -403.579379 hartree
zpe.sumelectthermalfe: -403.621923 hartree
dipole: 1.3627 -0.7595 -0.0071
dipole: 1.5600
quadrupole: -46.2147 -53.9032 -64.0568
quadrupole: -1.7331 -0.7362 -0.1394
quadrupole: 8.5102 0.8217 -9.3319 -1.7331 -0.7362 -0.1394
hfenergy: -403.7667125 hartree
pointgroup: C01 [X(C9H11N1)]
dipole: 0.5335908 -0.3032856 -0.0024323 debye
dipolederiv: -1.439037 0.4108028 0.0085338 0.4711632 -0.2329206 -0.0192754 0.0074731 -0.0184061 -0.7693474 0.123973 0.0279035 -0.0612604 0.0261549 -0.0057223 -0.0120624 0.020719 0.0045416 0.1504962 -0.0193584 0.0129125 -0.0144117 -0.0404547 0.0495288 0.0325655 0.0348259 0.0446209 0.1641621 0.0582909 -0.0620145 -0.013326 -0.0003011 0.0526853 -0.0290255 0.0312863 -0.0277089 0.1908679 0.1979629 -0.0739298 -0.014636 0.2212157 0.2422264 -0.0043294 -0.0755056 -0.0423682 -0.0315764 -0.042426 -0.0975068 -0.0018686 -0.286111 -0.3336843 0.00211 -0.0938249 0.01621 -0.1024462 -0.4482344 0.1732947 0.0014872 -0.257345 0.073341 -0.0024255 0.0207392 -0.0036428 -0.2588558 0.2564599 0.1551269 -0.0167348 -0.0017976 0.1642933 0.0001155 0.0038003 -0.0050933 -0.1363645 1.4485915 -0.446079 -0.0324932 -0.5812394 0.1488457 0.0180551 -0.027538 0.0225128 0.1505048 -0.3112183 -0.0330943 0.0003342 0.5147759 -0.0898242 -0.0195248 -0.0005075 -0.0086895 -0.2555735 -0.2189593 -0.0521013 0.0682716 -0.0564169 0.0575813 0.0136007 0.1139317 0.0218013 0.0499673 0.0800123 0.0080215 -0.0096919 0.0090778 0.0417763 -0.0049689 -0.0900049 -0.0187296 -0.1783057 0.0282336 0.0072172 0.0043825 -0.0315078 -0.1225828 -0.0940954 -0.0442255 -0.1395725 0.0188147 -0.0188952 -0.0500507 0.0284201 -0.0259508 0.0259739 0.0655812 0.0538023 0.1229152 -0.1278633 -0.0750062 0.0391393 0.0577685 0.0119382 0.044545 -0.054656 0.1205905 -0.1026646 -0.1343459 -0.0169825 0.0495371 -0.0324281 0.0898672 -0.0915247 0.0909807 -0.0964948 0.11922 0.0104275 0.0440304 0.0522277 0.0022102 0.0655228 -0.1272021 0.0024746 -0.0046984 -0.0019584 0.1678913 0.0784009 0.0505434 0.0007934 0.0270495 -0.129271 0.0016777 -0.0058136 0.0023626 0.1459496 -0.1056799 -0.1192244 0.0095855 -0.0987975 0.0004908 0.0058864 0.0111163 0.0094853 0.1698983 0.1968058 -0.0176111 0.0073723 -0.0130074 0.1104772 0.0043172 0.0100794 0.0038855 0.3880749 0.1830358 -0.0351146 0.0076915 -0.0438359 0.1209669 0.0029988 0.0102493 0.0012785 0.387624 unknown
polarizability: 140.7363253|-2.6094116|106.511812|-1.7406862|-0.456796|55.3664174 unknown
InChI: InChI=1S/C9H11N/c10-9-5-4-7-2-1-3-8(7)6-9/h4-6H,1-3,10H2
charge 0 multiplicity 1
21 atoms
N  3.269809 -0.684493 -0.050335
C  -2.835496 -0.387841 -0.295054
C  -1.764624 -1.443055 0.130221
C  -2.232047 0.995118 0.111639
C  -0.459393 -0.655714 0.054103
C  -0.728648 0.73847 0.043527
C  0.859715 -1.143676 0.028993
C  0.342756 1.653852 0.007759
C  1.947039 -0.2208 -0.014656
C  1.674215 1.179075 -0.023946
H  -3.825213 -0.575745 0.158329
H  -2.958281 -0.420443 -1.394647
H  -1.772575 -2.339719 -0.516264
H  -1.94289 -1.785376 1.17008
H  -2.535401 1.266027 1.143985
H  -2.566805 1.812262 -0.553298
H  1.057947 -2.223618 0.036995
H  0.154568 2.734438 0.000047
H  2.509099 1.890471 -0.061061
H  4.045782 -0.031468 -0.08862
H  3.469944 -1.679566 -0.052099
