program: Gaussian 09
title: 000090460
version: EM64L-G09RevD.01
frameworkgroup: C1[X(C6H12O2S)]
method: RPBEPBE
basis: SDD
operation: Freq
keyword: #p
keyword: freq=noraman
keyword: PBEPBE/SDD
title: #p freq=noraman PBEPBE/SDD
converged: YES YES NO NO
title: Mulliken charges:
elementType: S O O C C C C C C H H H H H H H H H H H H
charge: 0.188530 -0.421302 -0.212815 -0.064879 -0.652710 -0.676319 -0.645303 -0.707866 0.235520 0.218060 0.237584 0.211959 0.233797 0.234440 0.211989 0.212938 0.210892 0.237984 0.280071 0.285115 0.382316
chargesum: 0.00000
title: Mulliken charges with hydrogens summed into heavy atoms:
elementType: S O O C C C C C C
charge: 0.188530 -0.038986 -0.212815 -0.064879 0.014893 0.003906 0.016511 -0.142680 0.235520
polarizability: 1.16727908e+02 1.31711696e-01 8.54568678e+01 1.78414826e-02 -2.27152546e-01 6.55327777e+01
1716.lowfreq: -10.8863 -4.7588 0.0024 0.0024 0.0030 4.3880 8.4237 23.2336 57.2156
frequency: 4.0368 23.0594 57.1542 105.3757 191.7663 196.7026 246.1832 251.6919 270.8892 283.9169 343.1408 381.5168 389.5975 406.8303 499.7235 529.4860 568.3241 630.5100 752.5246 797.2147 867.7607 888.3756 924.5186 930.2015 947.4405 1016.2155 1020.8945 1040.9333 1149.8138 1166.2964 1224.5205 1236.1142 1236.8899 1309.6050 1373.9791 1376.1418 1399.7957 1426.9014 1449.5863 1462.6748 1464.4090 1473.8326 1476.2708 1490.7356 1677.5181 2968.6475 2972.4015 2978.5727 3018.2709 3055.5975 3061.1410 3074.4972 3081.9740 3084.6962 3090.1931 3091.8732 3515.5786
redmass: 2.6666 6.5218 3.9117 4.8231 3.6250 1.1804 1.0646 1.1183 2.4301 2.6459 3.3754 2.3899 3.4432 3.6103 1.8358 3.5708 4.7951 1.3761 6.2673 3.0882 5.2966 1.6999 1.5813 1.5995 1.2035 1.4241 1.4160 2.2640 1.1634 1.9512 1.3408 3.0546 3.0257 2.0671 1.2063 1.2068 1.2014 1.0992 1.0506 1.0477 1.0480 1.0529 1.0549 1.0497 8.7069 1.0369 1.0366 1.0358 1.0571 1.0973 1.0970 1.0985 1.1033 1.1010 1.0996 1.0995 1.0640
irintensity: 1.0805 0.7237 2.3825 1.3748 2.4692 0.4279 0.0204 0.0737 0.9318 1.0917 0.8389 0.1646 5.8102 4.1438 30.4851 1.7414 42.2312 139.6600 20.4348 0.2058 9.3152 7.9324 0.5993 1.2368 0.0893 0.5033 1.4450 335.8293 1.2568 75.8442 2.6324 4.7111 11.2635 52.5612 30.5446 28.9995 10.9665 35.5024 0.8165 0.7270 2.6306 15.4527 10.5177 22.6721 195.2801 22.2366 33.4746 30.4825 19.3022 4.4368 56.5739 40.0598 4.3612 1.9044 38.7106 33.3185 22.8854
temp: 298.150 k
press: 1.00000 atm
elementType: 16 8 8 6 6 6 6 6 6 1 1 1 1 1 1 1 1 1 1 1 1
symmnumber: 1
zpe: 448327.5 jmol-1
zpe.correction: 0.170759 hartree
zpe.thermalcorrener: 0.182740 hartree
zpe.thermalcorrenthalpy: 0.183684 hartree
zpe.thermalcorrgfe: 0.129480 hartree
zpe.sumelectzpe: -783.610797 hartree
zpe.sumelectthermal: -783.598816 hartree
zpe.sumelectthermalent: -783.597872 hartree
zpe.sumelectthermalfe: -783.652076 hartree
dipole: -1.2796 2.9785 -0.0808
dipole: 3.2428
quadrupole: -52.6579 -69.0793 -62.6277
quadrupole: 4.2747 0.0823 -0.1380
quadrupole: 8.7971 -7.6244 -1.1727 4.2747 0.0823 -0.1380
hfenergy: -783.7815559 hartree
pointgroup: C01 [X(C6H12O2S1)]
dipole: -0.4972749 -1.0663238 0.4932865 debye
dipolederiv: -0.2232065 -0.0753653 0.0274829 -0.0252832 -0.05774 -0.0782339 0.0016467 -0.0841399 -0.1880036 -0.9711222 0.5250296 -0.1929659 0.5085013 -0.7237444 0.0874565 -0.1609346 0.0821613 -0.4551065 -0.7360024 -0.1892285 0.0986596 0.0595243 -0.7915527 0.2016897 0.0046057 0.2179357 -0.3814659 0.6257007 0.1626176 -0.0693084 0.2303193 0.1724045 0.0232355 -0.0958969 0.0225575 0.2028094 -0.0775284 -0.0204499 0.0349017 -0.0598065 -0.0043517 0.0339375 -0.0203597 -0.000526 -0.1109502 -0.1072663 0.085976 -0.0374353 -0.0579188 -0.0266781 0.019509 0.0239472 0.018137 0.0072238 -0.0746495 -0.034152 -0.0106633 -0.0282507 -0.0763784 -0.0691407 0.0579119 -0.0366207 -0.0389141 -0.2130522 -0.1387414 0.1004401 -0.4173866 -0.0407502 0.0958503 0.2633701 0.0987211 0.1095748 1.594193 -0.2242394 0.0072365 -0.1999824 1.2044843 -0.3946478 -0.060843 -0.3974686 0.3629292 -0.0226789 0.1331092 -0.0856403 0.1281002 -0.0182584 0.0580259 -0.0432672 0.0347827 0.0473927 0.1087417 -0.0211269 -0.0183642 -0.0048992 -0.0655087 -0.1327188 -0.0120677 -0.0724877 0.0078575 -0.1488044 -0.1035894 0.0825623 -0.1052087 0.0616612 0.0394765 0.0638451 0.0249896 0.0489362 0.1122739 -0.0078211 0.0356139 0.0196712 0.0831228 0.0364847 -0.0103719 0.0615893 -0.1322744 0.1105586 -0.0287815 -0.0183806 0.0229283 -0.0764579 -0.0952069 -0.0046265 -0.1199306 0.0262447 -0.1645458 -0.051656 0.0204705 -0.0993297 0.0438189 0.0257031 0.041646 0.0258741 0.0957437 -0.0302737 0.1575365 -0.0337874 0.1226221 -0.0291856 0.0198604 -0.0607048 0.0449087 0.0632118 -0.1453912 -0.1320846 0.0254182 -0.121877 0.0187625 -0.0098645 0.0374562 0.0066456 0.0849494 0.1085663 -0.004552 0.0181459 0.0075937 0.0759401 0.0631421 0.0021627 0.0024193 -0.1332371 0.0429418 0.024289 -0.0124686 0.0770043 -0.0708279 -0.0418304 -0.0438291 -0.0398861 0.0745212 0.0357043 0.0282613 -0.0209341 0.0747452 0.063931 0.0508104 -0.0558594 0.0483047 -0.058501 0.1758412 -0.0850312 0.0490165 -0.1310671 0.2573088 0.0664614 0.0721692 0.0620329 0.3670586 unknown
polarizability: 116.7157806|-0.3001949|82.2781567|-0.7476194|-7.2959633|68.7236157 unknown
InChI: InChI=1S/C6H12O2S/c1-6(2,3)9-4-5(7)8/h7H,4H2,1-3H3
charge 0 multiplicity 1
21 atoms
S  -0.270536 0.860285 -0.401374
O  3.322154 -0.923593 0.23801
O  2.75924 1.176558 -0.586352
C  -1.924677 -0.070227 0.00949
C  -2.015723 -0.357981 1.522453
C  -3.006993 0.946254 -0.42005
C  -2.028641 -1.363722 -0.824469
C  0.996623 -0.3902 0.206732
C  2.401484 0.083224 -0.107677
H  -1.253495 -1.086953 1.852474
H  -1.890402 0.56852 2.10937
H  -3.007852 -0.789439 1.761253
H  -2.921891 1.191798 -1.493835
H  -2.927055 1.883885 0.15835
H  -4.010552 0.514846 -0.243695
H  -1.247165 -2.09674 -0.552851
H  -3.009066 -1.847868 -0.644978
H  -1.940697 -1.146323 -1.902887
H  0.840911 -1.371351 -0.272745
H  0.91289 -0.525552 1.299299
H  4.244041 -0.601621 0.042779
