program: Gaussian 09
title: 000090462
version: EM64L-G09RevD.01
frameworkgroup: C1[X(C8H6ClN3O)]
method: RPBEPBE
basis: SDD
operation: Freq
keyword: #p
keyword: freq=noraman
keyword: PBEPBE/SDD
title: #p freq=noraman PBEPBE/SDD
converged: NO NO NO NO
title: Mulliken charges:
elementType: Cl O N N N C C C C C C C C H H H H H H
charge: -0.032992 -0.235648 -0.185352 -0.082626 -0.001811 0.164531 0.052063 0.258204 -0.312655 -0.293359 -0.218813 -0.552688 -0.197569 0.279376 0.269164 0.296230 0.304865 0.244449 0.244630
chargesum: 0.00000
title: Mulliken charges with hydrogens summed into heavy atoms:
elementType: Cl O N N N C C C C C C C C
charge: -0.032992 -0.235648 -0.185352 -0.082626 -0.001811 0.164531 0.052063 0.258204 -0.033278 -0.024195 0.025636 0.048408 0.047061
polarizability: 1.85607904e+02 -5.57871236e-01 1.18146694e+02 8.41203710e+00 -5.66401017e-02 6.38688573e+01
1716.lowfreq: -10.9466 -8.1698 -0.0024 -0.0011 0.0012 5.6334 49.1905 58.9738 117.6647
frequency: 49.0779 58.9513 117.6635 151.5062 219.4054 261.6256 310.2497 336.6860 420.9696 447.7591 471.6675 482.4673 523.3993 551.3782 607.2861 630.0861 677.7848 692.8347 764.7481 781.8417 792.8545 805.0711 850.2264 904.7948 951.2152 985.8338 1001.0453 1011.5408 1026.5018 1096.2494 1165.6349 1188.3835 1192.7579 1248.6985 1267.3714 1283.3982 1302.6226 1380.4991 1410.2089 1414.4961 1444.7568 1464.0939 1568.1905 1613.3609 1627.8882 3104.3106 3145.5605 3158.4916 3171.6897 3181.8504 3202.6210
redmass: 10.2025 7.9703 7.4836 7.7764 6.6865 3.8128 4.2086 6.8108 3.4681 5.7841 6.1789 8.0164 7.0500 9.2076 5.2631 6.1092 6.4286 4.8670 7.0607 3.5639 1.5438 3.0763 6.1256 1.4468 7.1616 1.3778 1.9549 1.3510 2.0984 2.2158 1.3131 2.1301 2.2359 2.1264 2.0444 1.6698 1.2802 5.8901 3.1466 1.4685 2.5297 2.8477 6.8877 6.6465 11.4023 1.0540 1.0868 1.0905 1.0960 1.1000 1.1156
irintensity: 2.9623 0.4837 2.0051 1.5713 1.0431 2.3970 6.7055 13.0930 1.6416 7.2661 9.6699 19.8644 15.9476 4.8905 18.6196 41.4832 3.9910 53.7550 43.3946 28.8059 49.9408 103.2323 26.0257 0.1990 21.9323 3.0022 46.5844 0.0407 11.7810 6.2940 0.7281 21.1125 19.7336 90.6228 81.2411 2.1662 10.9231 44.9593 8.6183 37.4079 21.0694 2.9540 9.2273 5.4404 240.8510 7.4968 3.0890 4.3581 5.3336 14.1582 1.0049
temp: 298.150 k
press: 1.00000 atm
elementType: 17 8 7 7 7 6 6 6 6 6 6 6 6 1 1 1 1 1 1
symmnumber: 1
zpe: 344043.6 jmol-1
zpe.correction: 0.131039 hartree
zpe.thermalcorrener: 0.141434 hartree
zpe.thermalcorrenthalpy: 0.142378 hartree
zpe.thermalcorrgfe: 0.093720 hartree
zpe.sumelectzpe: -1007.043019 hartree
zpe.sumelectthermal: -1007.032625 hartree
zpe.sumelectthermalent: -1007.031680 hartree
zpe.sumelectthermalfe: -1007.080339 hartree
dipole: 4.5675 0.1983 -0.9756
dipole: 4.6748
quadrupole: -68.4411 -89.1079 -81.3357
quadrupole: 2.9274 8.2169 0.5613
quadrupole: 11.1871 -9.4796 -1.7075 2.9274 8.2169 0.5613
hfenergy: -1007.1740587 hartree
pointgroup: C01 [X(C8H6Cl1N3O1)]
dipole: 1.7680978 0.0365721 -0.5050954 debye
dipolederiv: -0.5705759 0.0083576 0.1301174 0.056995 -0.1405946 -0.0215724 0.5325644 -0.0184869 -0.4704304 -0.5313252 0.200934 -0.046002 0.2600528 -1.0283644 0.1202464 -0.0386858 0.0504124 -0.3453947 -0.9551236 -0.2743869 0.182804 0.7322001 -0.9849368 0.021531 -0.2126775 -0.0556368 -0.1395391 -0.4606256 0.3663355 0.0567095 0.3022928 -0.1577314 0.0210777 -0.0332114 0.0383745 -0.1335237 0.2841323 -0.4706672 -0.0176655 -0.9755907 0.5748144 0.0179727 0.0730675 -0.0496726 -0.1511496 -0.3516851 0.226123 -0.0630753 0.3061991 -0.1070921 0.0365448 -0.0448235 0.0418499 0.0202689 0.2692931 0.0300872 -0.0124679 -0.266233 -0.0373105 -0.0581639 0.024158 0.0021463 0.1013603 0.8287184 0.030113 0.0432016 -0.130146 1.3536268 -0.1784833 0.0784724 -0.0305091 0.2627088 -0.2327185 -0.1811379 0.00964 -0.0027383 0.0552991 -0.001209 -0.0222501 -0.0200321 -0.1058344 -0.2313018 -0.039093 0.0100065 -0.1424033 0.1406312 -0.0071837 -0.0190515 -0.011218 -0.1086051 0.1161412 0.2075382 0.019812 0.0383827 0.00184 0.0195052 0.0354279 0.026554 -0.1256477 1.3966595 -0.0405798 -0.3996679 -0.1629058 0.1341684 0.0713624 -0.5146513 0.0521016 0.7140718 0.2139693 -0.0649311 0.0404953 -0.0060864 -0.007252 -0.0201441 0.0505176 -0.0087102 -0.1277773 0.1000225 0.0515235 -0.00968 -0.0076677 0.0118548 -0.0000472 -0.0072793 0.0079974 0.1555121 0.1056057 -0.0009348 -0.0086471 0.0425679 -0.0170565 0.0056893 -0.0084068 0.0006655 0.1631866 0.0540941 0.0050327 0.0457334 -0.0801603 0.0561628 -0.0727143 0.0683401 -0.0503522 -0.0104254 0.0590857 -0.0224085 0.0695985 0.0793492 0.0528614 0.0493594 0.0939393 0.0278008 -0.0101219 -0.0120124 -0.0839114 -0.0204325 -0.0966493 0.0149196 -0.0107972 -0.0223413 -0.0113135 0.1576398 -0.0823539 0.052006 -0.03048 0.0525409 0.0841598 0.0070262 -0.0331085 0.0080289 0.153701 unknown
polarizability: 186.1098787|-2.3486686|118.2181244|0.030571|0.5288061|63.2954517 unknown
InChI: InChI=1S/C8H6ClN3O/c9-5-12-8(13)6-3-1-2-4-7(6)10-11-12/h1-4H,5H2
charge 0 multiplicity 1
19 atoms
Cl -3.868759 0.184476 1.261874
O  -1.181128 2.113524 -0.36334
N  -1.657239 -0.188656 -0.3756
N  -0.039004 -1.897394 -0.181777
N  -1.295412 -1.587123 -0.33073
C  0.640636 0.510035 -0.100493
C  0.952062 -0.883493 -0.050317
C  -0.759168 0.927972 -0.283884
C  1.676003 1.467688 0.032569
C  2.29339 -1.31023 0.132842
C  3.002892 1.038282 0.215365
C  -3.077083 0.025418 -0.464982
C  3.311002 -0.350355 0.265809
H  1.413032 2.529347 -0.008348
H  2.495635 -2.38473 0.166524
H  -3.555666 -0.846412 -0.923842
H  -3.289357 0.981397 -0.956776
H  3.805353 1.775634 0.320086
H  4.347812 -0.671082 0.40962
