program: Gaussian 09
title: 000090448
version: EM64L-G09RevD.01
frameworkgroup: C1[X(C10H9NO2)]
method: RPBEPBE
basis: SDD
operation: Freq
keyword: #p
keyword: freq=noraman
keyword: PBEPBE/SDD
title: #p freq=noraman PBEPBE/SDD
converged: YES YES NO NO
title: Mulliken charges:
elementType: O O N C C C C C C C C C C H H H H H H H H H
charge: -0.415330 -0.197469 -0.172708 0.282497 0.287885 -0.191421 -0.506977 -0.414648 -0.342316 -0.400346 -0.228789 -0.243819 0.201953 0.272891 0.273216 0.248024 0.254476 0.227877 0.238208 0.220446 0.221139 0.385211
chargesum: 0.00000
title: Mulliken charges with hydrogens summed into heavy atoms:
elementType: O O N C C C C C C C C C C
charge: -0.030119 -0.197469 -0.172708 0.282497 0.287885 0.056604 0.039130 -0.160172 -0.114439 -0.162138 -0.008343 -0.022679 0.201953
polarizability: 1.50788097e+02 9.08051554e+00 1.28674992e+02 -1.59317671e+01 4.53396702e+00 6.89627280e+01
1716.lowfreq: -9.0143 -0.0002 0.0005 0.0006 3.1620 11.4032 30.6715 33.8903 63.2597
frequency: 30.6577 33.7014 63.2511 183.2224 216.5599 248.2033 301.8231 350.7330 421.8919 448.1995 483.8334 538.1403 559.0393 575.1680 590.1374 624.9616 633.2107 728.5890 748.4512 751.4310 764.9169 775.6025 833.2654 849.9543 860.9655 873.3901 931.2257 951.1700 971.7674 1013.4847 1033.9073 1049.5388 1086.7833 1131.1350 1167.9186 1187.8458 1211.8485 1254.3034 1258.8885 1322.4966 1350.1295 1361.1332 1371.9765 1419.6805 1442.5470 1466.5562 1474.1967 1519.7203 1585.5198 1626.2055 1691.8202 3013.5980 3070.2642 3123.0775 3131.3400 3145.4846 3162.9828 3207.7592 3234.2719 3520.4709
redmass: 10.6284 4.9912 5.5523 5.1000 4.0785 2.5837 6.2562 6.4841 2.8017 2.3502 2.5404 4.9943 4.7958 3.9680 3.5476 3.4909 1.6407 1.4159 1.4883 4.4982 3.6622 2.7190 3.8694 1.4973 1.4361 5.1067 1.3890 2.3489 1.3079 2.1632 2.7194 1.6201 2.2935 1.4270 1.1009 1.4954 1.7002 1.6490 1.4934 1.9964 1.6278 2.6552 3.7657 4.1443 1.1696 3.6637 2.8386 4.7155 6.7141 7.4078 8.9364 1.0607 1.1005 1.0851 1.0888 1.0952 1.1002 1.0902 1.1070 1.0643
irintensity: 0.5364 0.2301 1.0686 0.5647 6.2022 1.4355 0.0664 7.1603 10.3587 8.8674 17.7827 20.5674 31.5308 2.6861 1.7510 25.3011 113.7638 12.0450 114.5497 21.3655 32.7564 24.8874 1.1189 0.4541 7.4304 5.5061 4.2214 2.0200 0.1741 10.5667 323.3670 12.9010 7.5161 0.5238 0.3651 18.4637 4.3911 20.5922 9.6494 48.7891 12.9316 22.7275 7.5757 13.8774 26.6786 45.8075 38.1182 27.1850 0.5663 3.4727 189.6971 25.7259 1.2538 1.9684 5.7646 36.8671 28.2371 0.5175 4.1310 28.3132
temp: 298.150 k
press: 1.00000 atm
elementType: 8 8 7 6 6 6 6 6 6 6 6 6 6 1 1 1 1 1 1 1 1 1
symmnumber: 1
zpe: 442500.7 jmol-1
zpe.correction: 0.168540 hartree
zpe.thermalcorrener: 0.179270 hartree
zpe.thermalcorrenthalpy: 0.180214 hartree
zpe.thermalcorrgfe: 0.130275 hartree
zpe.sumelectzpe: -590.747909 hartree
zpe.sumelectthermal: -590.737178 hartree
zpe.sumelectthermalent: -590.736234 hartree
zpe.sumelectthermalfe: -590.786173 hartree
dipole: 2.4319 -0.2675 -1.6350
dipole: 2.9426
quadrupole: -62.3277 -67.1230 -82.3275
quadrupole: -1.5008 -3.4619 -1.1366
quadrupole: 8.2650 3.4697 -11.7348 -1.5008 -3.4619 -1.1366
hfenergy: -590.9164483 hartree
pointgroup: C01 [X(C10H9N1O2)]
dipole: -0.950412 0.1161438 -0.6508145 debye
dipolederiv: -1.1725389 0.3396931 -0.3131671 0.4541378 -0.6211126 0.1714161 -0.1693951 0.10067 -0.3425399 -0.6071901 0.1238727 0.0442846 0.2115958 -0.3499318 0.0312082 -0.1021528 0.1496142 -0.8809692 -0.8487288 -0.0142304 -0.0848148 0.3563396 -0.4434428 0.0966388 -0.297745 0.0292727 -0.2148396 0.5461313 0.3286388 0.0426077 0.1939953 -0.14121 0.0338383 0.0985265 0.112302 0.0452751 -0.1395833 0.0030493 -0.036497 0.390646 0.1647912 0.0534872 -0.0955675 -0.0099798 0.0098612 0.1671668 -0.2673222 0.1043425 -0.5518436 0.2630519 -0.1556608 0.1339222 -0.1479646 -0.1023727 0.7316249 -0.0788603 0.0876078 -0.216641 0.1667377 -0.053743 0.3067106 -0.0630708 0.0095212 -0.3409172 0.0785061 0.0156913 -0.0835649 -0.0093669 -0.057894 0.0080634 -0.02678 -0.2500112 -0.0568091 0.0274962 0.0287354 -0.0595657 0.0880884 -0.031915 0.0371473 -0.0253962 -0.1762893 0.0809369 0.0118548 0.0683218 -0.0540682 0.0889837 -0.0505012 0.0789844 -0.0385044 -0.1463144 -0.0156064 -0.1038576 0.0533115 -0.0316855 0.0543313 -0.0413361 0.0513117 -0.0546496 -0.1652711 0.0411541 0.0577586 0.0598024 0.0223032 -0.1470273 -0.0021452 0.0582736 0.0107589 -0.1670504 1.2805075 -0.5395712 0.1190043 -0.6782773 0.5166657 -0.142331 0.0949236 -0.1813761 1.1504489 -0.0363012 -0.0133269 -0.0298719 -0.0807418 0.0343492 -0.0902487 -0.0308613 -0.0318046 0.0855978 0.0569593 -0.0065894 0.050298 0.0815391 -0.0019007 0.0973508 0.0056589 0.0452611 0.0700039 0.0060896 -0.0965626 -0.0399446 -0.0586009 0.0609057 0.010954 -0.0381742 0.0032434 0.1824772 0.0746507 0.0636154 -0.0395005 0.0222357 -0.0341958 0.0383386 -0.0402528 0.0496857 0.1808679 -0.0275323 0.1115586 -0.0654765 0.0813912 0.0129594 0.0338475 -0.0584482 0.0480436 0.1450172 -0.0210364 0.0689813 -0.0561011 0.1046643 0.0028328 0.0500824 -0.0648116 0.0426158 0.1385689 0.074928 -0.0479055 -0.0149636 -0.0586396 -0.1263722 0.0277135 -0.0163466 0.0262649 0.1548953 -0.1137936 -0.0799236 -0.0607859 -0.0833264 0.0569919 -0.006449 -0.0627049 -0.0065589 0.1502511 0.3198881 0.0331248 0.0671157 0.0381069 0.363871 -0.0126516 0.1029379 -0.0316472 0.1228723 unknown
polarizability: 151.101336|8.8647297|127.9474227|16.0145217|-6.2609755|69.3770581 unknown
InChI: InChI=1S/C10H9NO2/c12-10(13)7-11-6-5-8-3-1-2-4-9(8)11/h1-6,12H,7H2
charge 0 multiplicity 1
22 atoms
O  -3.870596 1.079624 -0.205155
O  -2.567455 0.155914 1.491776
N  -0.620414 -0.643004 -0.520045
C  0.562987 0.081995 -0.289946
C  1.572827 -0.86087 0.118242
C  -0.375363 -2.001413 -0.242925
C  -1.896448 -0.074528 -0.904904
C  0.950087 -2.169415 0.140841
C  0.82619 1.463964 -0.416896
C  2.881625 -0.388058 0.399544
C  2.135111 1.904065 -0.13141
C  3.151618 0.988276 0.27183
C  -2.760362 0.373238 0.283326
H  -2.485608 -0.811042 -1.48177
H  -1.751706 0.794199 -1.571183
H  -1.173321 -2.736555 -0.339881
H  1.421922 -3.113461 0.407016
H  0.051801 2.180168 -0.713968
H  3.668256 -1.083399 0.712868
H  2.374574 2.96994 -0.216059
H  4.156369 1.368543 0.487231
H  -4.453494 1.354621 0.553368
