program: Gaussian 09
title: 000090471
version: EM64L-G09RevD.01
frameworkgroup: C1[X(C8H8Cl4N2)]
method: RPBEPBE
basis: SDD
operation: Freq
keyword: #p
keyword: freq=noraman
keyword: PBEPBE/SDD
title: #p freq=noraman PBEPBE/SDD
converged: YES YES NO NO
title: Mulliken charges:
elementType: Cl Cl Cl Cl N N C C C C C C C C H H H H H H H H
charge: -0.000878 -0.000584 -0.000546 -0.000941 -0.529495 -0.529621 0.664521 0.664700 -0.302149 -0.348843 -0.348560 -0.301786 -0.541227 -0.541059 0.246520 0.245333 0.245291 0.246514 0.280378 0.285950 0.280417 0.286063
chargesum: 0.00000
title: Mulliken charges with hydrogens summed into heavy atoms:
elementType: Cl Cl Cl Cl N N C C C C C C C C
charge: -0.000878 -0.000584 -0.000546 -0.000941 0.036834 0.036859 0.664521 0.664700 -0.302149 -0.348843 -0.348560 -0.301786 -0.049375 -0.049254
polarizability: 1.92942279e+02 4.72757025e-01 1.81642231e+02 -6.10962178e-01 -5.39684716e-01 7.21097597e+01
1716.lowfreq: -10.3580 0.0032 0.0033 0.0036 6.2488 10.3415 28.6082 35.7319 57.3039
frequency: 28.6052 35.0899 57.3038 63.4547 79.9307 127.7034 187.2716 207.4640 209.8125 212.6184 279.8295 285.3153 305.1992 310.7911 314.9010 336.7249 357.9658 369.3601 384.3588 426.4541 515.6661 546.9170 572.0833 588.6097 590.0326 600.0051 650.7654 769.8487 783.5275 791.5323 863.2251 876.6293 936.5721 1059.0628 1089.7362 1095.6988 1113.0835 1141.6057 1185.0019 1312.4466 1318.8485 1332.4004 1334.0662 1343.3106 1360.9940 1369.9117 1455.2347 1456.6641 1518.8626 1555.6413 1637.9835 1638.3744 3036.7701 3037.0257 3100.9473 3101.0982 3483.7892 3484.7770 3615.8297 3616.8241
redmass: 3.2455 3.3263 8.3312 9.7607 8.7901 8.4829 5.2321 14.6737 27.5168 15.9381 1.6309 1.5176 20.3058 4.9717 23.8452 9.7699 1.5087 1.5138 6.3488 6.0064 1.7744 1.4458 3.1851 5.9208 11.8826 3.3318 9.7311 10.3400 10.8111 7.7237 1.3217 1.3499 8.4495 8.3549 4.9256 5.2771 1.3718 1.2804 10.6551 2.4161 1.9932 1.2169 4.5834 1.1938 2.3150 2.0012 1.0805 1.0973 7.6200 11.1854 1.0882 1.0906 1.0613 1.0612 1.1027 1.1027 1.0445 1.0445 1.0998 1.0998
irintensity: 0.7771 0.0001 0.1889 0.1380 0.0000 1.6789 0.0000 0.2147 0.0000 0.8857 0.1004 33.0101 0.0001 18.6232 0.0000 0.0001 0.0172 69.4872 0.0000 9.3073 0.1578 863.8786 0.0491 62.2999 1.3174 0.0424 29.7789 0.0002 0.0002 32.3972 34.9343 0.0001 0.0001 138.2615 0.3519 77.8882 57.3424 0.0001 0.0001 92.5632 10.0472 0.0086 54.6049 0.0002 13.1694 19.3375 0.0101 27.9689 0.0001 0.0001 88.4394 0.0021 20.7580 25.1356 6.3467 1.6409 8.9066 7.8930 5.9287 6.0301
temp: 298.150 k
press: 1.00000 atm
elementType: 17 17 17 17 7 7 6 6 6 6 6 6 6 6 1 1 1 1 1 1 1 1
symmnumber: 1
zpe: 391547.1 jmol-1
zpe.correction: 0.149132 hartree
zpe.thermalcorrener: 0.164660 hartree
zpe.thermalcorrenthalpy: 0.165604 hartree
zpe.thermalcorrgfe: 0.104209 hartree
zpe.sumelectzpe: -2258.326511 hartree
zpe.sumelectthermal: -2258.310983 hartree
zpe.sumelectthermalent: -2258.310039 hartree
zpe.sumelectthermalfe: -2258.371434 hartree
dipole: 0.0044 0.0005 -0.0006
dipole: 0.0045
quadrupole: -116.7521 -115.2851 -104.7638
quadrupole: -1.3874 -3.8013 -1.2845
quadrupole: -4.4851 -3.0181 7.5032 -1.3874 -3.8013 -1.2845
hfenergy: -2258.4756429 hartree
pointgroup: C01 [X(C8H8Cl4N2)]
dipole: 0.0016648 0.0005001 0.0002203 debye
dipolederiv: -0.2644305 -0.3244218 0.0186707 -0.2741318 -0.5902813 0.0315653 -0.002292 0.029036 -0.0401911 -0.2348137 0.3046086 0.053857 0.2553637 -0.6054146 -0.0931705 0.0189495 -0.0873861 -0.0503238 -0.2350392 0.3045964 0.0537728 0.2557902 -0.605076 -0.0930485 0.0188869 -0.0870924 -0.0502808 -0.264248 -0.3243353 0.0186563 -0.2736506 -0.5900925 0.0314816 -0.0023069 0.0291113 -0.0402126 -1.2933614 -0.0233902 -0.0150931 -0.0330049 -0.1614918 -0.0298677 -0.1113164 -0.0364712 -0.4533042 -1.294498 -0.0240809 -0.0146414 -0.0343195 -0.161941 -0.0306387 -0.1111573 -0.0373204 -0.4537558 -0.3548232 -0.0075034 -0.0568123 0.0069932 -0.4466422 -0.0385638 0.1502208 -0.0273877 -0.0421955 -0.3573153 -0.007682 -0.0572098 0.0073191 -0.446951 -0.03887 0.1497961 -0.0275409 -0.0421007 0.2411633 0.4301283 -0.0300897 0.5250761 0.7400678 -0.0732065 -0.0094804 -0.0251944 -0.061131 0.2228894 -0.4086914 -0.0741786 -0.4904581 0.7765741 0.1648552 -0.0664577 0.1124615 -0.0374379 0.2227778 -0.4085484 -0.0741581 -0.4913521 0.7760505 0.1643773 -0.0664099 0.1119273 -0.0376718 0.2414604 0.4297408 -0.0299665 0.5242285 0.7400078 -0.0731329 -0.0096393 -0.025173 -0.0611521 0.861815 0.013503 0.0958683 0.0064386 0.0921428 0.0230178 0.0858771 0.0145138 0.3901474 0.864236 0.0140363 0.0963705 0.0071384 0.092346 0.0235839 0.0869562 0.0148929 0.3903267 -0.0082054 -0.0179928 -0.0152417 -0.0462095 0.0100409 0.1332035 -0.0097668 0.0611265 0.0108799 0.0188977 0.0185572 -0.0207895 0.0587218 -0.0136202 -0.1176817 -0.0038262 -0.0488858 0.0496136 0.0190121 0.0185833 -0.0208269 0.0587592 -0.0139483 -0.1174096 -0.0036899 -0.0486673 0.0500948 -0.0086089 -0.0179813 -0.015227 -0.0459755 0.0104565 0.1333139 -0.0097041 0.0612562 0.0102042 0.3958829 -0.1085059 0.031579 -0.0798893 0.1042222 0.0523419 -0.0227969 0.056863 0.0999225 0.4152659 0.1237168 0.012314 0.0714496 0.0945218 -0.0522852 -0.0290518 -0.0485284 0.1341362 0.3961437 -0.1080296 0.0313916 -0.0795793 0.104408 0.0522696 -0.0232079 0.0569208 0.0997663 0.4157992 0.1236925 0.0117542 0.0712922 0.0946204 -0.0521349 -0.0295829 -0.0484618 0.1346657 unknown
polarizability: 191.3884035|4.0006742|182.7633946|-3.3472118|6.0584028|72.5424712 unknown
InChI: InChI=1S/C8H8Cl4N2/c9-5-3(1-13)6(10)8(12)4(2-14)7(5)11/h1-2,13-14H2
charge 0 multiplicity 1
22 atoms
Cl -1.67532 -2.815792 0.188636
Cl 1.477663 -2.835432 -0.394378
Cl -1.596969 2.756521 0.469784
Cl 1.556339 2.736929 -0.112479
N  -3.833207 -0.221167 -0.609488
N  3.714616 0.146893 0.684406
C  -1.483698 -0.036795 0.323028
C  1.364636 -0.042063 -0.246695
C  -0.763156 -1.238434 0.114245
C  0.620048 -1.244562 -0.16021
C  -0.739105 1.165711 0.236326
C  0.644121 1.159521 -0.037906
C  -3.004317 -0.053059 0.588423
C  2.885548 -0.025347 -0.512336
H  -3.228411 -0.876348 1.287133
H  -3.287262 0.888366 1.084388
H  3.16885 -0.96806 -1.005643
H  3.10848 0.795982 -1.213769
H  -3.813346 0.558096 -1.271223
H  -3.775985 -1.139638 -1.05566
H  3.696676 -0.630635 1.348109
H  3.6575 1.066513 1.128009
