program: Gaussian 09
title: 000090503
version: EM64L-G09RevD.01
frameworkgroup: C1[X(C10H13BrClOPS2)]
method: RPBEPBE
basis: SDD
operation: Freq
keyword: #p
keyword: freq=noraman
keyword: PBEPBE/SDD
title: #p freq=noraman PBEPBE/SDD
converged: YES YES NO NO
title: Mulliken charges:
elementType: Br Cl S S P O C C C C C C C C C C H H H H H H H H H H H H H
charge: 0.025105 0.008207 0.055225 -0.213084 0.508571 -0.483244 0.031812 -0.654617 -0.663035 -0.720270 -0.221190 -0.217208 -0.175923 -0.166368 -0.166415 -0.200719 0.233233 0.213367 0.235187 0.226043 0.207666 0.241008 0.224850 0.307008 0.319500 0.259462 0.271060 0.256905 0.257863
chargesum: 0.00000
title: Mulliken charges with hydrogens summed into heavy atoms:
elementType: Br Cl S S P O C C C C C C C C C C
charge: 0.025105 0.008207 0.055225 -0.213084 0.508571 -0.483244 0.265045 0.019981 0.010489 -0.093762 -0.221190 0.042255 0.095137 0.090537 0.091447 -0.200719
polarizability: 3.18106250e+02 1.53112926e+00 1.59087283e+02 -2.82443377e+00 4.96447951e+00 1.71127713e+02
1716.lowfreq: -15.2913 -6.5490 -4.1631 -0.0021 0.0008 0.0014 7.6092 23.0985 32.6050
frequency: -9.1833 23.0677 32.5655 34.2435 44.4205 62.4827 82.6787 97.3057 115.0412 123.8555 148.2951 177.7483 182.7721 188.0410 214.9483 228.5767 254.8497 298.2884 306.5344 313.3245 328.6688 392.8800 407.5207 420.5726 444.2671 462.9267 492.9119 519.9052 616.7544 638.5910 657.1561 698.7157 704.0639 727.6728 822.7890 827.5471 828.7330 838.0450 904.2836 926.2380 936.3182 953.6183 968.8290 985.1254 1052.1388 1067.6492 1095.8145 1102.3689 1142.0270 1154.0003 1179.3328 1183.4592 1230.8168 1283.1944 1323.4573 1333.8634 1353.4486 1377.6731 1379.1699 1381.0348 1396.1593 1448.6325 1453.6878 1461.6692 1467.8696 1483.4951 1565.0333 1566.4806 2988.0852 2992.7627 2994.3542 3070.7961 3085.0155 3092.4970 3098.4411 3107.2602 3149.5416 3161.8926 3169.4434 3174.2842 3181.4224
redmass: 8.5234 9.1620 2.9131 4.4924 4.7661 6.2974 10.5583 10.5183 5.1041 7.9881 8.3138 1.0604 4.8056 3.7333 3.3393 1.4823 20.8547 4.7062 5.1873 4.2528 3.7287 8.3452 2.8832 4.0834 3.0613 8.9433 3.3089 7.9282 7.1431 7.1649 4.3899 4.2465 6.5805 8.2774 1.4272 2.7194 1.5881 1.5780 3.0429 1.2530 1.3076 1.3326 1.3744 6.3254 5.8660 2.0206 1.6403 1.3945 1.0482 2.0804 1.9496 1.1154 1.1295 1.2371 1.1726 1.4830 4.1461 4.2968 1.0821 1.2439 1.2159 2.1056 1.0495 1.0487 1.0479 1.0505 6.6835 7.1562 1.0358 1.0826 1.0388 1.0540 1.0990 1.0996 1.1004 1.1007 1.0893 1.0889 1.1121 1.0965 1.0979
irintensity: 0.0743 0.2004 0.0515 1.1359 0.7860 0.5387 0.4811 1.0502 6.3679 2.9387 1.7662 0.1274 2.7220 0.3077 0.1904 0.9104 3.7530 2.7082 2.0057 2.3945 0.2281 43.5816 1.6709 33.3153 17.5273 10.9510 30.0912 36.7770 0.3793 31.1671 38.4538 1.2425 9.6860 26.6061 40.4549 148.5219 72.5622 26.7648 97.6415 3.2370 0.1271 0.5780 1.3736 88.8900 34.5550 12.7878 106.9399 6.1138 3.8322 10.4129 17.3362 3.6851 9.2879 0.8232 29.4966 4.1872 1.3059 14.0068 7.7413 27.9046 25.3727 73.2248 7.3609 1.9324 11.2595 13.0532 24.4485 19.1974 12.3509 7.3069 27.6535 1.5469 21.1587 29.4785 25.1808 24.4843 1.2983 1.4273 0.3516 4.7619 0.7729
temp: 298.150 k
press: 1.00000 atm
elementType: 35 17 16 16 15 8 6 6 6 6 6 6 6 6 6 6 1 1 1 1 1 1 1 1 1 1 1 1 1
symmnumber: 1
zpe: 545386.2 jmol-1
zpe.correction: 0.207727 hartree
zpe.thermalcorrener: 0.226803 hartree
zpe.thermalcorrenthalpy: 0.227747 hartree
zpe.thermalcorrgfe: 0.156479 hartree
zpe.sumelectzpe: -2073.746644 hartree
zpe.sumelectthermal: -2073.727567 hartree
zpe.sumelectthermalent: -2073.726623 hartree
zpe.sumelectthermalfe: -2073.797891 hartree
dipole: -1.3083 -1.2960 1.7221
dipole: 2.5213
quadrupole: -130.2984 -133.0665 -135.2714
quadrupole: 9.8253 1.4268 9.9346
quadrupole: 2.5803 -0.1877 -2.3926 9.8253 1.4268 9.9346
hfenergy: -2073.9543705 hartree
pointgroup: C01 [X(C10H13Br1Cl1O1P1S2)]
dipole: -0.4959413 0.4647687 -0.7224888 debye
polarizability: 315.6463025|11.7336004|159.9968548|15.0519554|6.2128101|172.6780882 unknown
InChI: InChI=1S/C6H4BrS.C4H9ClOPS/c7-5-1-3-6(8)4-2-5;1-4(2)6-7(8)3-5/h1-4H;4H,3H2,1-2H3
charge 0 multiplicity 1
29 atoms
Br 5.880301 0.203452 1.093928
Cl -2.250219 -3.595601 0.094463
S  -0.1595 0.687391 -1.529802
S  -0.959314 -0.406275 2.008594
P  -1.437459 -0.586615 0.008943
O  -3.046849 -0.18448 -0.508586
C  -3.872928 0.798174 0.279845
C  -3.493077 2.231932 -0.112583
C  -5.320024 0.423588 -0.051269
C  -1.307319 -2.271619 -0.812001
C  1.501316 0.528436 -0.765801
C  2.468969 -0.308032 -1.375102
C  1.831438 1.26906 0.395082
C  3.76981 -0.401551 -0.833079
C  3.12685 1.171214 0.951629
C  4.079507 0.338642 0.328512
H  -3.657818 0.620296 1.353111
H  -4.1405 2.949048 0.424969
H  -2.443515 2.457821 0.14445
H  -3.62877 2.383903 -1.197681
H  -6.011917 1.071112 0.517664
H  -5.52086 -0.627585 0.21429
H  -5.519042 0.560015 -1.128553
H  -0.249572 -2.568304 -0.836344
H  -1.731541 -2.17919 -1.821783
H  2.210585 -0.878066 -2.273321
H  1.083684 1.912663 0.866298
H  4.520833 -1.041066 -1.305004
H  3.382431 1.735535 1.852531
