program: Gaussian 09
title: 000090439
version: EM64L-G09RevD.01
frameworkgroup: C1[X(C6H10O5)]
method: RPBEPBE
basis: SDD
operation: Freq
keyword: #pfreq=noraman
keyword: PBEPBE/SDD
title: #p freq=noraman PBEPBE/SDD
converged: NO YES NO NO
title: Mulliken charges:
elementType: O O O O O C C C C C C H H H H H H H H H H
charge: -0.233237 -0.409137 -0.422421 -0.431985 -0.202549 -0.109647 -0.122618 -0.218665 -0.074625 0.182608 -0.714768 0.230828 0.309498 0.222666 0.247555 0.212632 0.247885 0.234654 0.333131 0.365920 0.352274
chargesum: 0.00000
title: Mulliken charges with hydrogens summed into heavy atoms:
elementType: O O O O O C C C C C C
charge: -0.233237 -0.076006 -0.056501 -0.079711 -0.202549 0.121181 0.186880 0.004001 0.172931 0.182608 -0.019597
polarizability: 9.14516088e+01 7.08889379e+00 8.05956907e+01 -4.42853604e+00 -3.57655552e+00 6.45041019e+01
1716.lowfreq: -6.2179 -5.7399 -0.0010 -0.0010 0.0004 18.2819 59.6887 77.1468 98.7190
frequency: 59.6446 76.9695 98.6825 154.2878 211.8030 232.3161 241.4318 255.5661 270.8470 307.0982 336.1318 349.4762 415.0378 448.2166 466.8660 522.7457 539.9836 590.4773 614.3737 711.7927 820.4879 852.4357 892.8707 929.0150 957.4129 1014.2241 1033.0047 1056.1531 1074.7908 1089.3873 1111.7094 1122.0459 1165.8951 1228.9336 1243.3790 1257.4924 1285.0755 1293.3980 1319.7074 1346.7145 1358.4786 1369.6348 1391.9110 1401.0945 1470.0595 1475.8999 1702.0857 2894.0271 2986.0011 3019.2472 3043.7218 3081.3936 3087.7486 3102.5377 3510.9347 3539.9040 3543.2093
redmass: 6.8156 4.3162 6.0554 4.6791 3.2619 2.2081 1.4580 1.5842 2.7570 3.4790 1.3730 3.7388 1.2196 2.7866 4.3508 4.8283 4.0728 4.1869 6.4860 5.1575 3.9936 4.4320 4.6655 2.3320 3.6469 1.7229 3.7124 3.9243 3.1963 2.0680 2.2710 2.3546 1.2297 1.4303 1.3043 1.3952 1.4147 1.2717 1.3711 1.5717 1.4972 1.1711 1.2194 1.3013 1.0499 1.0502 12.6682 1.0803 1.0367 1.0852 1.0869 1.0984 1.0866 1.0998 1.0658 1.0655 1.0661
irintensity: 0.4733 0.5896 3.8833 1.0197 50.9415 10.2009 14.0172 3.3324 63.1745 61.3590 144.9757 37.5200 125.3802 49.0111 9.1944 5.5341 7.6395 15.3788 1.3772 4.3533 12.2491 6.0230 56.7087 81.0198 45.5246 34.6321 190.1642 60.4495 165.5625 17.7147 50.9460 34.5111 21.7824 10.5226 26.5595 6.8105 9.7323 36.9503 1.9576 4.6313 5.2929 26.2442 21.3326 10.3110 11.1419 9.4275 312.0653 46.1165 14.5333 27.3377 6.5522 32.3408 4.2784 21.2453 17.4170 8.8678 6.7384
temp: 298.150 k
press: 1.00000 atm
elementType: 8 8 8 8 8 6 6 6 6 6 6 1 1 1 1 1 1 1 1 1 1
symmnumber: 1
zpe: 424529.4 jmol-1
zpe.correction: 0.161695 hartree
zpe.thermalcorrener: 0.173406 hartree
zpe.thermalcorrenthalpy: 0.174350 hartree
zpe.thermalcorrgfe: 0.124381 hartree
zpe.sumelectzpe: -609.853047 hartree
zpe.sumelectthermal: -609.841336 hartree
zpe.sumelectthermalent: -609.840392 hartree
zpe.sumelectthermalfe: -609.890361 hartree
dipole: 1.2245 0.5682 -3.6652
dipole: 3.9059
quadrupole: -62.7830 -76.0086 -64.0175
quadrupole: -1.7961 -0.2264 -8.6433
quadrupole: 4.8201 -8.4056 3.5855 -1.7961 -0.2264 -8.6433
hfenergy: -610.0147419 hartree
pointgroup: C01 [X(C6H10O5)]
dipole: 0.4735607 -0.009779 1.4618675 debye
dipolederiv: -1.4509696 0.3568748 -0.1650076 0.0791595 -0.5735551 0.0278149 -0.1471335 0.0765441 -0.2861564 -0.4986113 -0.068318 -0.1143105 -0.064531 -0.7697665 0.183507 -0.143486 0.2753089 -0.2164699 -0.7242197 -0.1563323 -0.1188401 -0.1759399 -0.2258232 0.0334509 -0.135662 0.0550505 -0.5622859 -0.7091472 -0.1356678 -0.0164854 -0.1471474 -0.2020267 0.1568949 0.0282191 0.1111276 -0.7273767 -0.8694892 0.2517042 -0.1037055 0.4079365 -0.856968 0.1058946 -0.1737342 0.1381255 -0.3518672 0.3012071 -0.2239969 0.0403968 -0.3969446 0.3337246 -0.0548627 -0.0247295 -0.0820922 0.2372723 0.1481887 -0.0505522 -0.0155599 0.097759 0.6477819 -0.172636 0.0996862 -0.1644381 0.2172631 0.3936261 0.1314698 0.1426014 -0.0164513 -0.2358643 0.0764959 0.1634275 0.0262538 0.5632612 0.4941393 0.0969967 0.0484487 0.063596 0.2427998 -0.0878956 0.0198268 -0.0828024 0.5624704 1.7346743 -0.4516271 0.2469695 -0.2706136 1.0320138 -0.1617272 0.2927587 -0.2532746 0.2301325 -0.1188562 -0.0987355 -0.0653207 -0.0975773 -0.0114597 -0.0595679 -0.0054097 -0.0278794 -0.0536326 0.0276194 0.0144661 0.0151082 0.0613157 0.0036632 0.0306057 -0.033867 0.0476321 -0.1497047 0.11459 0.0209362 0.0111468 0.0436359 0.0707273 0.0076038 -0.0224534 0.0105446 0.0033628 0.0089405 -0.0051644 0.0003121 -0.014514 0.0299396 0.0326564 -0.0109593 0.0127568 -0.2027997 0.0429318 0.0283446 -0.0216982 0.0354025 -0.0848926 0.0225283 0.0104179 -0.008867 0.0364673 0.0890418 -0.009143 -0.041657 0.009279 0.0621336 0.0787537 -0.0746462 0.0581409 -0.1281731 -0.1053375 -0.0186666 0.0798025 -0.0136152 0.0917071 -0.0168099 0.1165223 -0.0053423 0.0419975 0.0821298 0.0969782 -0.0118601 0.044769 -0.0897468 -0.0162509 -0.0145458 0.010963 0.0942875 0.3113495 0.0294354 0.1100914 0.0602784 0.3033629 -0.1342612 0.1110499 -0.0550825 0.0549827 0.3355417 0.0941421 -0.0033493 0.190445 0.1693603 -0.0047032 -0.0014434 -0.0514073 0.3391133 0.3926507 0.0968556 -0.0170832 0.1037578 0.0628889 -0.0474916 -0.0538384 -0.091262 0.2978555 unknown
polarizability: 92.1750058|-5.5993322|78.6568851|5.8082679|-5.1373702|65.7195105 unknown
InChI: InChI=1S/C6H10O5/c1-2(7)5-3(8)4(9)6(10)11-5/h2-5,7-9H,1H3
charge 0 multiplicity 1
21 atoms
O  0.128184 1.20246 0.417821
O  -0.214568 -2.484234 0.651888
O  -2.6908 -0.776324 -0.656155
O  1.847754 0.114142 -1.561092
O  -1.983226 2.021172 -0.138677
C  0.730135 -0.173781 0.608474
C  -0.33535 -1.164005 0.05412
C  -1.657381 -0.411614 0.285773
C  2.073412 -0.202098 -0.14327
C  -1.244558 1.069862 0.159406
C  3.132378 0.715716 0.488478
H  0.87941 -0.32179 1.695459
H  -0.184017 -1.315567 -1.02702
H  -2.000872 -0.572155 1.336888
H  2.422525 -1.250651 -0.149883
H  3.383259 0.388768 1.514597
H  4.053854 0.690777 -0.116922
H  2.771496 1.759286 0.541076
H  -0.559703 -2.467626 1.581533
H  -3.295203 0.003742 -0.781566
H  1.571571 1.066019 -1.619928
