program: Gaussian 09
title: 000090422
version: EM64L-G09RevD.01
frameworkgroup: C1[X(C2H3NO2S)]
method: RPBEPBE
basis: SDD
operation: Freq
keyword: #p
keyword: freq=noraman
keyword: PBEPBE/SDD
title: #p freq=noraman PBEPBE/SDD
converged: NO NO NO NO
title: Mulliken charges:
elementType: S O O N C C H H H
charge: 0.996248 -0.491038 -0.491148 0.042090 -0.716544 -0.217917 0.289022 0.300243 0.289044
chargesum: 0.00000
title: Mulliken charges with hydrogens summed into heavy atoms:
elementType: S O O N C C
charge: 0.996248 -0.491038 -0.491148 0.042090 0.161764 -0.217917
polarizability: 7.19338316e+01 1.09421608e+00 4.91450049e+01 2.14227636e-02 6.28214448e-03 5.16548714e+01
1716.lowfreq: -19.3627 -13.3866 -1.9289 -0.0032 -0.0025 -0.0016 119.4827 119.6046 157.9464
frequency: 119.4498 119.5414 157.9355 231.0670 252.0782 282.9341 367.3378 376.3651 399.5222 571.9257 822.9917 919.6623 986.7886 1040.0830 1314.6140 1406.2521 1416.5918 2088.9973 3031.4113 3181.6637 3193.3892
redmass: 5.9286 6.9918 1.0924 4.2191 7.5334 9.7217 8.2349 10.6981 11.0585 9.4706 12.3666 2.5336 1.3031 2.1719 1.1308 1.0512 1.0521 12.7972 1.0244 1.1078 1.1088
irintensity: 5.7085 4.0154 0.2237 0.1937 3.8747 13.5333 24.5958 8.3382 115.9669 44.3401 59.6713 26.1055 37.7997 71.6921 2.5378 13.8755 14.8194 49.8194 1.2250 0.1897 0.1380
temp: 298.150 k
press: 1.00000 atm
elementType: 16 8 8 7 6 6 1 1 1
symmnumber: 1
zpe: 133267.6 jmol-1
zpe.correction: 0.050759 hartree
zpe.thermalcorrener: 0.058435 hartree
zpe.thermalcorrenthalpy: 0.059380 hartree
zpe.thermalcorrgfe: 0.018861 hartree
zpe.sumelectzpe: -680.575627 hartree
zpe.sumelectthermal: -680.567950 hartree
zpe.sumelectthermalent: -680.567006 hartree
zpe.sumelectthermalfe: -680.607525 hartree
dipole: -1.8430 4.6107 -0.0039
dipole: 4.9654
quadrupole: -49.3505 -39.6263 -48.3035
quadrupole: -5.1714 -0.0052 -0.0062
quadrupole: -3.5904 6.1338 -2.5434 -5.1714 -0.0052 -0.0062
hfenergy: -680.6263858 hartree
pointgroup: C01 [X(C2H3N1O2S1)]
dipole: 0.9260485 1.720078 -0.0023309 debye
dipolederiv: 1.9564858 -0.127757 0.0010321 -0.1020938 1.4873312 -0.0005831 -0.0001134 -0.0003126 1.4151041 -0.5252052 0.0026789 -0.0173959 -0.0004849 -0.5335847 0.0096371 0.0985907 -0.1112554 -0.5722166 -0.5256339 0.0028597 0.0172115 -0.0004757 -0.5333991 -0.00962 -0.0993051 0.1114074 -0.5726287 -0.0079013 -0.0034778 0.0015151 -0.038348 -0.1111575 -0.0002491 -0.0002954 0.000156 -0.1009645 -0.1037179 0.0546554 -0.000263 -0.0329401 -0.1598372 0.0001557 -0.0000008 0.0001731 -0.1078174 -0.9799437 0.1060278 -0.0021781 0.2230319 -0.2745173 0.0004806 0.0010441 -0.0002672 -0.2647607 0.0830015 -0.0245331 0.0413387 -0.0200953 0.0299579 -0.0298115 0.0600662 -0.0142084 0.0380661 0.0199598 0.0142228 -0.0000051 -0.0084195 0.0651518 0.0000402 0.0000637 0.0000756 0.127175 0.0829548 -0.0246767 -0.0412553 -0.0201746 0.0300549 0.0299501 -0.0600499 0.0142314 0.0380425 unknown
polarizability: 71.3944103|-3.632804|49.6843329|0.0460702|-0.0063154|51.6549647 unknown
InChI: InChI=1S/C2H3NO2S/c1-6(4,5)2-3/h1H3
charge 0 multiplicity 1
9 atoms
S  0.619544 -0.246538 0.000793
O  0.94749 -0.958526 -1.412343
O  0.948464 -0.954579 1.415712
N  -2.460109 0.383594 -0.003137
C  1.314047 1.532738 -0.002226
C  -1.280106 0.172773 0.001479
H  0.943271 2.010806 0.914093
H  2.406506 1.407303 -0.002491
H  0.942595 2.008329 -0.919579
