program: Gaussian 09
title: 000090424
version: EM64L-G09RevD.01
frameworkgroup: C1[X(C6H17N3)]
method: RPBEPBE
basis: SDD
operation: Freq
keyword: #pfreq=noraman
keyword: PBEPBE/SDD
title: #p freq=noraman PBEPBE/SDD
converged: YES YES NO NO
title: Mulliken charges:
elementType: N N N C C C C C C H H H H H H H H H H H H H H H H H
charge: -0.086331 -0.295272 -0.579826 -0.343945 -0.375273 -0.335672 -0.392102 -0.621519 -0.610332 0.192027 0.196368 0.210004 0.204204 0.234755 0.193762 0.206166 0.192959 0.206153 0.233572 0.185492 0.218907 0.219756 0.186126 0.223230 0.275617 0.261174
chargesum: 0.00000
title: Mulliken charges with hydrogens summed into heavy atoms:
elementType: N N N C C C C C C
charge: -0.086331 -0.060517 -0.043035 0.044449 0.038935 0.064255 0.007011 0.016453 0.018780
polarizability: 1.12936300e+02 5.06133033e-01 8.22126223e+01 -7.47368168e-01 4.40029375e-01 7.00229463e+01
1716.lowfreq: -19.5077 -5.4066 -0.0005 -0.0002 0.0006 6.9254 39.2030 45.5640 74.1422
frequency: 38.5969 45.4706 74.1152 101.0112 117.2368 154.6150 196.0961 216.2256 230.0565 243.9067 266.4294 329.8097 354.9302 423.3959 472.8985 509.4285 600.9906 690.6330 799.6333 809.4712 821.6678 957.1169 1006.9060 1029.6415 1032.6897 1061.4321 1065.1966 1083.0259 1093.3645 1112.7146 1125.6789 1144.8372 1152.7457 1222.8903 1235.7079 1245.7007 1264.7254 1279.3284 1285.3637 1304.6990 1345.4225 1378.2104 1396.2079 1417.6629 1440.5823 1456.8291 1461.2812 1462.8334 1473.7347 1477.5993 1481.2871 1485.0623 1491.9019 1498.4346 1643.4454 2840.1165 2849.2292 2866.2315 2887.5426 2895.0504 2912.4084 2981.7937 2990.6215 3013.3423 3015.3458 3018.2502 3027.4864 3074.4365 3084.8316 3416.2866 3464.2543 3591.6764
redmass: 2.8823 2.1987 3.4837 1.9773 2.3424 2.2649 2.1494 1.3109 1.1933 1.2395 2.2680 2.4135 2.6528 2.3840 2.8027 3.4734 1.3021 1.2717 1.1565 1.4700 2.2303 1.7735 2.8323 2.2187 1.5049 2.2297 1.6853 1.8567 1.5202 2.3323 1.3040 2.2311 2.4358 2.1622 1.4425 1.2962 2.5405 1.1249 1.1431 1.3280 1.3471 1.4233 1.4857 1.1466 1.1691 1.1475 1.0680 1.0984 1.0606 1.0581 1.0796 1.0576 1.0895 1.0808 1.0935 1.0574 1.0613 1.0655 1.0684 1.0684 1.0669 1.0891 1.0869 1.0964 1.0722 1.0916 1.0718 1.1010 1.1002 1.0738 1.0450 1.0977
irintensity: 0.2946 0.2191 0.4604 3.6887 6.1293 4.8117 8.9023 27.4808 13.6854 0.2989 9.7759 15.6213 3.1275 0.4795 2.2017 8.7597 249.5713 97.0844 3.2070 1.0773 14.1986 0.8030 7.0924 25.6599 13.7555 1.2900 15.1211 11.4245 10.4699 5.0115 29.5356 24.1630 54.3914 5.1507 9.8758 7.4431 6.7290 2.6617 0.6415 0.9859 0.8679 2.5000 1.1837 1.8507 0.4105 24.5604 1.8165 13.5916 7.1014 23.7403 5.8439 15.8855 3.5493 3.1504 40.7274 74.3447 96.6861 123.3693 98.4019 53.9380 186.2673 7.0340 8.6380 69.9582 33.4931 102.4805 46.9554 36.0074 46.6466 2.8315 0.8614 0.3566
temp: 298.150 k
press: 1.00000 atm
elementType: 7 7 7 6 6 6 6 6 6 1 1 1 1 1 1 1 1 1 1 1 1 1 1 1 1 1
symmnumber: 1
zpe: 616314.8 jmol-1
zpe.correction: 0.234742 hartree
zpe.thermalcorrener: 0.247225 hartree
zpe.thermalcorrenthalpy: 0.248170 hartree
zpe.thermalcorrgfe: 0.195459 hartree
zpe.sumelectzpe: -402.256976 hartree
zpe.sumelectthermal: -402.244492 hartree
zpe.sumelectthermalent: -402.243548 hartree
zpe.sumelectthermalfe: -402.296258 hartree
dipole: 0.2871 -0.3299 1.0399
dipole: 1.1281
quadrupole: -50.2484 -54.4315 -62.7680
quadrupole: -1.4636 2.7778 3.2026
quadrupole: 5.5675 1.3845 -6.9520 -1.4636 2.7778 3.2026
hfenergy: -402.4917174 hartree
pointgroup: C01[X(C6H17N3)]
dipole: 0.1140334 0.1355134 -0.40696 debye
dipolederiv: -0.6750095 0.0205438 -0.0500113 0.0119933 -0.5074826 -0.0002612 -0.0134971 -0.0021564 -0.5783054 -0.8830864 0.0075085 -0.0059677 -0.0024304 -0.2560056 0.1923116 -0.0034083 0.2152242 -0.4556716 -0.6704542 0.121708 -0.0462898 0.144719 -0.317427 0.1975511 -0.0847831 0.1807669 -0.6622746 0.4455795 0.117345 -0.0862569 0.1544882 0.1525433 -0.0151639 -0.0677076 0.0050042 0.4084415 0.4152322 0.1312621 -0.0961151 0.2769395 0.2268321 -0.0395745 0.006601 -0.0123358 0.3515212 0.4382991 -0.1287189 0.1094831 -0.3339965 0.2287806 -0.0243398 0.03858 0.0060315 0.3537988 0.4929375 -0.1494284 0.1150202 -0.1232299 0.2610842 -0.060576 -0.0167021 -0.0007149 0.3660025 0.0787592 0.0772822 0.0497401 0.0951462 0.3449349 0.0962854 0.0903226 0.0914892 0.4112067 0.3219307 -0.176523 0.0699459 -0.2445389 0.2295989 -0.0680225 0.0814891 -0.0658286 0.3708885 0.0345399 -0.0309141 0.0083017 -0.0508891 -0.1710139 -0.0635603 -0.0032929 -0.0901733 0.0307669 -0.0510656 -0.0176838 -0.0254771 -0.0135002 0.041122 0.0051384 0.0888928 0.0759834 -0.2631044 0.0596215 0.0273519 0.0232113 -0.0200477 -0.1412842 -0.0685936 0.0053197 -0.0916319 0.0110692 -0.0529324 -0.028201 0.0354799 -0.0711388 0.0155462 0.0637965 0.1019632 0.0974699 -0.2313049 0.1021093 0.0061255 0.0033441 -0.00092 0.0270696 -0.0981081 -0.0008246 -0.195183 0.1883062 0.0315294 -0.0185396 -0.0262363 0.0345682 -0.1432622 -0.0918486 -0.0026732 -0.1161779 -0.0034274 -0.0582581 0.0219153 -0.0183517 0.0715531 0.0078038 0.0795958 -0.0981328 0.1100135 -0.2327428 0.0245026 0.0120991 -0.0132234 0.0098771 -0.1446102 -0.0941393 -0.0138974 -0.1303059 0.0044733 -0.040067 0.0602913 -0.0703923 0.0442791 0.0015932 0.0882387 -0.0622793 0.1279671 -0.2309251 -0.0085279 0.1691419 -0.0548323 0.1353364 -0.0401258 0.0224211 -0.0639337 0.0158608 0.0504926 0.0653928 -0.0299235 -0.0143957 -0.0172853 -0.0280636 0.0257958 -0.076711 -0.1529052 -0.2946429 -0.1419077 -0.1356159 0.0759702 -0.063449 0.0614081 0.008561 0.0909456 0.020176 0.0419546 -0.1642255 -0.0292225 0.0780666 -0.1090429 0.0627168 0.0604375 0.0848453 0.0519035 0.044294 -0.0260059 0.0724137 -0.0150081 0.0876166 0.0088949 0.0180436 -0.1879842 0.1363115 -0.266981 0.0934985 -0.0672773 -0.0473594 0.0129332 -0.1475112 -0.0941598 -0.0395271 -0.0905108 0.0402365 0.0059083 -0.0504884 0.0296334 -0.0743333 0.1137717 -0.0084802 0.1418168 0.0141448 0.3400386 0.1616998 0.0175482 -0.0282795 0.0453523 0.1130859 -0.1313486 0.0045781 -0.2004231 0.2058889 unknown
polarizability: 112.9327499|-0.1685257|82.1938288|1.0119327|0.5804602|70.0452896 unknown
InChI: InChI=1S/C6H17N3/c1-9(2)6-5-8-4-3-7/h8H,3-7H2,1-2H3
charge 0 multiplicity 1
26 atoms
N  -2.753984 -0.069399 0.235569
N  1.000188 0.420007 -0.076584
N  4.723248 -0.247035 0.035024
C  -1.466292 0.475814 -0.257229
C  -0.242144 -0.313157 0.251385
C  2.252428 -0.309153 0.220622
C  3.480609 0.50131 -0.241524
C  -3.047287 -1.423074 -0.277747
C  -3.87423 0.860685 -0.011896
H  -1.387571 1.518219 0.113273
H  -1.421535 0.525534 -1.375058
H  -0.183439 -1.29893 -0.249103
H  -0.377742 -0.506567 1.34347
H  1.003328 1.353563 0.360407
H  2.223174 -1.270551 -0.33303
H  2.385385 -0.562704 1.299493
H  3.522296 1.449104 0.332008
H  3.328654 0.775758 -1.311457
H  -2.261022 -2.131176 0.034111
H  -3.128467 -1.463159 -1.39519
H  -4.003749 -1.777001 0.147182
H  -4.798595 0.459099 0.441462
H  -4.074957 1.039877 -1.099968
H  -3.659061 1.836695 0.459303
H  5.577812 0.31526 0.0030
H  4.815054 -1.114416 -0.502823
