program: Gaussian 09
title: 000090428
version: EM64L-G09RevD.01
frameworkgroup: C1[X(C5H10O5)]
method: RPBEPBE
basis: SDD
operation: Freq
keyword: #pfreq=noraman
keyword: PBEPBE/SDD
title: #p freq=noraman PBEPBE/SDD
converged: YES YES NO NO
title: Mulliken charges:
elementType: O O O O O C C C C C H H H H H H H H H H
charge: -0.449982 -0.445291 -0.426268 -0.427706 -0.220390 -0.215049 -0.187992 -0.104722 -0.311975 -0.048954 0.249906 0.282555 0.260189 0.247102 0.173043 0.363296 0.211100 0.335631 0.366290 0.349215
chargesum: 0.00000
title: Mulliken charges with hydrogens summed into heavy atoms:
elementType: O O O O O C C C C C
charge: -0.086686 -0.109660 -0.059978 -0.078491 -0.220390 0.034857 0.094563 0.155468 0.108170 0.162147
polarizability: 7.46765119e+01 -3.07113998e+00 6.94584459e+01 -4.98692515e-01 4.74061063e-01 6.56358822e+01
1716.lowfreq: -2.6674 -0.0010 0.0005 0.0008 6.1981 10.7931 53.8718 73.3308 108.5125
frequency: 53.6801 73.3242 108.5075 113.1352 128.9680 211.0953 238.3958 243.6199 294.9000 357.9500 372.8691 388.9978 418.5449 489.2757 504.0413 529.0848 586.3530 659.6397 759.3240 832.1582 839.9200 896.8477 944.9915 973.0893 985.2252 1006.6980 1062.2553 1082.1163 1105.6750 1139.8213 1180.6021 1218.3396 1244.3974 1256.5016 1320.2171 1335.2849 1345.9980 1348.4517 1368.6779 1375.8281 1384.6936 1390.9379 1468.5091 1609.7253 2912.2723 2953.0410 3012.8685 3072.0431 3076.6783 3097.3306 3432.1390 3465.1200 3514.9491 3518.2744
redmass: 4.4998 7.0444 6.2106 3.8280 3.9019 5.6660 4.5721 5.8212 4.6176 3.4660 1.2098 3.6994 3.4077 1.1407 3.2912 1.0910 2.9790 1.1299 3.7733 4.0299 2.9526 2.4318 5.1763 2.7625 2.8217 2.1675 3.5898 3.0848 1.8558 1.1115 1.1797 1.3284 1.4935 1.4362 1.3405 1.2957 1.2360 1.3691 1.1734 1.3029 1.3034 1.1775 1.0877 7.5535 1.0717 1.0887 1.0851 1.0857 1.0851 1.0913 1.0652 1.0656 1.0657 1.0655
irintensity: 2.2023 5.7170 12.6912 0.3449 6.0125 13.0139 5.2796 19.3248 6.8108 11.8795 55.0515 22.3569 17.8222 217.5853 4.9277 67.7978 22.7382 324.0550 1.9321 41.1099 9.0266 42.7932 65.0854 24.9823 37.1781 30.3078 38.9700 23.2753 11.5789 100.5314 21.7085 64.7446 20.8731 12.7146 20.5604 4.7932 14.2883 1.2508 8.3397 42.2003 28.5066 46.6642 4.9874 86.4193 70.6436 82.9278 19.4987 7.8470 8.7699 14.2221 49.0424 25.2526 10.3360 2.6734
temp: 298.150 k
press: 1.00000 atm
elementType: 8 8 8 8 8 6 6 6 6 6 1 1 1 1 1 1 1 1 1 1
symmnumber: 1
zpe: 408545.0 jmol-1
zpe.correction: 0.155607 hartree
zpe.thermalcorrener: 0.167072 hartree
zpe.thermalcorrenthalpy: 0.168017 hartree
zpe.thermalcorrgfe: 0.118206 hartree
zpe.sumelectzpe: -571.774125 hartree
zpe.sumelectthermal: -571.762659 hartree
zpe.sumelectthermalent: -571.761715 hartree
zpe.sumelectthermalfe: -571.811526 hartree
dipole: -0.8819 2.6218 0.4090
dipole: 2.7962
quadrupole: -68.8687 -60.3830 -62.1908
quadrupole: 7.5744 2.8931 -1.0233
quadrupole: -5.0545 3.4311 1.6234 7.5744 2.8931 -1.0233
hfenergy: -571.9297319 hartree
pointgroup: C01 [X(C5H10O5)]
dipole: 0.3244574 0.0121636 -1.0511047 debye
dipolederiv: -0.7326986 0.0401923 -0.0312094 0.0179001 -0.4394883 0.221241 -0.0315753 0.2208572 -0.5380109 -0.7359625 0.0832996 0.0042018 0.1008748 -0.3748568 0.3113215 0.0315804 0.32224 -0.4840892 -0.7414598 0.0502933 -0.0617166 0.0705397 -0.5170868 -0.2359323 0.0074319 -0.2235335 -0.3779835 -0.8578927 0.1049854 -0.0059032 0.1142637 -0.4848524 -0.1820512 -0.0304174 -0.1776905 -0.3028023 -0.4621523 -0.1035228 0.0767873 -0.166975 -0.4034972 0.0113587 0.09964 -0.1418668 -0.815755 0.2569504 0.0332461 0.073678 -0.083138 0.2328722 -0.0496633 0.1375557 -0.1540348 0.3800078 0.247424 0.0089627 0.0506017 -0.1159871 0.2159443 -0.1588387 0.087478 -0.2025379 0.3892255 0.3040362 -0.1277244 0.0796835 -0.104053 0.1946163 -0.0592677 -0.0582966 0.0129808 0.096558 0.4423941 -0.1966118 -0.0093845 -0.0946586 0.3582498 0.2033976 -0.0312839 0.1508124 0.2761691 0.4457335 0.3006098 -0.1246007 0.3679128 0.4165315 0.1596546 -0.1382193 0.1769157 0.8857054 0.0365402 -0.0321851 -0.0645517 -0.034464 -0.0159263 -0.0823611 -0.0456531 -0.0514881 -0.0614788 0.0875078 -0.0083016 -0.0461132 -0.0346128 -0.0101675 -0.0445764 -0.0222314 -0.0222587 -0.0183971 0.1051489 0.0143942 0.0029781 0.0109828 0.0131786 0.042852 -0.0328243 0.0720006 -0.0247089 0.0912032 0.0316176 -0.0069335 0.0419009 0.0227874 0.05094 -0.0259952 0.0988176 -0.0244511 -0.0192205 0.0207712 0.0177233 0.0117817 -0.0597694 -0.1141036 -0.001015 -0.1888281 -0.1459289 0.4111097 0.0455088 -0.0142688 0.0978498 0.2715628 -0.1261026 0.0029764 -0.0720779 0.2614282 -0.0833846 -0.1852051 0.0241795 -0.1663277 -0.0129656 0.02958 0.0593006 0.0415089 0.0162192 0.3722041 -0.0187277 -0.023366 -0.0450282 0.108409 -0.1882965 -0.0351099 -0.1144419 0.1775834 0.4154182 -0.0393076 0.0200536 -0.0039682 0.2696383 0.1018469 0.0018657 0.1027207 0.1473947 0.4171008 -0.022295 0.0381609 0.0152063 0.2148202 0.1090013 0.0247924 0.1499043 0.1633144 unknown
polarizability: 74.5396394|-0.0488086|65.5869644|-3.2212288|-0.1613316|69.6442361 unknown
InChI: InChI=1S/C5H10O5/c6-1-3(8)5(10)4(9)2-7/h1,3-5,7-10H,2H2
charge 0 multiplicity 1
20 atoms
O  0.375699 -1.528002 0.818939
O  -1.520355 1.106934 -1.166438
O  2.391022 -0.692523 -1.069446
O  -3.613681 0.191738 0.605487
O  1.462668 0.939685 1.656159
C  0.032073 -0.642907 -0.312089
C  -1.229165 0.201281 -0.021851
C  1.269829 0.195575 -0.69209
C  -2.469646 -0.655624 0.276679
C  1.826157 1.051885 0.454442
H  -0.170104 -1.344003 -1.14599
H  -1.057213 0.898378 0.815812
H  1.070143 0.824506 -1.574592
H  -2.297318 -1.300062 1.152765
H  -2.688351 -1.309041 -0.601273
H  0.573752 -0.931498 1.595862
H  2.6564 1.736243 0.165934
H  -1.719411 0.552963 -1.967669
H  2.390441 -1.437401 -0.404844
H  -3.62874 0.939575 -0.048999
