program: Gaussian 09
title: 000090504
version: EM64L-G09RevD.01
frameworkgroup: C1[X(C25H28O6)]
method: RPBEPBE
basis: SDD
operation: Freq
keyword: #pfreq=noraman
keyword: PBEPBE/SDD
title: #p freq=noraman PBEPBE/SDD
converged: YES YES NO NO
title: Mulliken charges:
elementType: O O O O O O C C C C C C C C C C C C C C C C C C C C C C C C C H H H H H H H H H H H H H H H H H H H H H H H H H H H H
charge: -0.261498 -0.261494 -0.269122 -0.269084 -0.251168 -0.251156 0.035892 0.445847 0.445728 -0.757706 -0.757650 -0.400096 -0.399906 -0.392613 -0.392697 -0.403365 -0.403369 -0.368993 -0.368886 0.340378 0.340350 -0.279652 -0.279679 -0.290325 -0.290324 0.263699 0.263620 -0.208836 -0.208795 -0.472541 -0.472541 0.229061 0.209147 0.234825 0.234863 0.209117 0.229029 0.246228 0.246172 0.246698 0.246755 0.247832 0.247827 0.243164 0.243156 0.203775 0.223688 0.203788 0.223658 0.251281 0.222621 0.222662 0.251258 0.253259 0.253272 0.229115 0.247310 0.229115 0.247304
chargesum: 0.00000
title: Mulliken charges with hydrogens summed into heavy atoms:
elementType: O O O O O O C C C C C C C C C C C C C C C C C C C C C C C C C
charge: -0.261498 -0.261494 -0.269122 -0.269084 -0.251168 -0.251156 0.035892 0.445847 0.445728 -0.084673 -0.084642 -0.153868 -0.153733 -0.145914 -0.145942 -0.155533 -0.155541 -0.125829 -0.125730 0.340378 0.340350 0.147811 0.147767 0.183578 0.183596 0.263699 0.263620 0.044423 0.044477 0.003884 0.003878
polarizability: 3.89276506e+02 1.30158145e-02 2.88299350e+02 -1.97911477e+01 5.11247028e-02 2.40094154e+02
1716.lowfreq: -4.5544 -0.0011 0.0011 0.0014 1.0055 3.4221 7.8769 12.7320 14.2123
frequency: 7.8755 12.7313 14.0036 15.3669 21.6444 23.4035 37.5416 50.0903 53.5593 69.9842 85.2505 85.8239 96.1823 105.9132 116.3467 130.2080 151.7565 158.7029 171.0318 187.6000 198.4828 209.7217 230.4265 236.4679 243.9898 272.7700 283.9431 286.0321 286.9176 295.8265 322.8001 328.5410 342.3362 373.3023 405.6138 411.4549 414.7048 416.4628 440.6784 455.2318 458.7306 460.6060 469.1652 503.3745 506.4606 506.4932 552.2526 567.3827 584.1572 627.8815 633.8400 645.9639 657.2870 662.6840 726.9605 741.0924 741.6202 774.6816 778.6062 779.8878 802.3375 806.4421 806.9486 821.3870 824.0067 835.8572 836.5875 889.8435 889.9333 915.5849 916.0364 919.1330 929.2848 948.5317 951.0483 963.9047 965.9249 994.8096 994.8250 1002.2227 1002.8680 1004.4260 1004.4946 1009.7474 1018.1751 1018.4569 1043.4798 1044.0248 1062.6613 1062.6865 1083.1148 1110.7918 1110.8713 1113.2039 1115.2553 1125.5047 1131.4549 1132.8901 1157.6283 1184.8214 1188.1341 1206.8079 1206.8777 1225.1601 1227.5446 1230.6264 1247.9655 1255.7743 1255.8230 1288.6760 1288.7658 1309.3166 1310.2541 1355.7034 1356.7963 1359.8643 1363.1002 1379.5291 1392.3749 1392.7231 1399.1704 1411.5442 1411.6350 1415.3952 1415.7566 1452.4546 1452.4730 1460.4850 1460.9189 1466.3675 1474.7506 1488.1308 1488.6414 1500.8191 1501.7867 1578.9574 1582.8881 1620.8632 1621.8308 1624.2861 1624.3824 1641.8941 1641.9205 2959.0934 2959.1441 2976.0520 2979.2905 3014.1229 3014.1387 3026.7685 3026.7891 3071.5188 3073.6747 3083.1167 3084.3610 3086.6291 3086.6733 3104.4986 3104.5214 3124.6979 3124.8085 3143.7139 3143.7741 3157.2817 3157.3401 3160.0938 3160.1325 3166.5124 3166.6782 3220.7053 3220.7235
redmass: 6.3166 5.4728 4.8533 5.1746 5.2965 5.5934 5.6736 3.9479 4.1541 4.2952 4.5559 4.5788 4.5668 3.5886 4.5651 5.1418 4.0414 3.8811 3.5086 3.3796 3.8207 3.9499 3.2844 3.0258 2.7106 2.6550 1.9991 3.8842 2.3806 1.6272 1.2101 2.6771 2.8988 3.8655 3.8794 2.9585 3.0141 3.6704 3.8511 4.0305 4.0527 3.9952 3.6889 3.3351 1.7737 1.7765 2.4613 2.6179 4.1559 6.2106 7.0276 5.0179 3.4738 3.5478 3.2896 3.3570 3.7145 3.8076 3.3833 3.6867 2.9804 2.3071 2.3594 1.6383 1.5274 1.6251 1.5837 3.5376 3.5409 3.8141 3.7427 2.3833 1.5143 1.4012 1.3491 1.3593 1.3625 1.4050 1.4052 3.0219 2.3300 1.0770 1.0774 1.4429 2.6329 2.6154 2.4443 2.4638 1.5965 1.5966 1.8896 2.2825 2.2926 2.1709 1.9445 1.3787 4.2253 4.0681 2.1791 1.3182 1.3074 1.0927 1.0933 2.6185 2.6483 3.5589 3.5015 1.1080 1.1066 1.4380 1.4382 1.2923 1.2853 1.8212 1.4037 2.3372 3.6525 1.1951 1.6270 1.6471 1.2256 1.2370 1.2368 3.4372 3.3179 1.0805 1.0805 1.1186 1.1127 1.0569 1.0742 1.0827 1.0510 2.1181 2.3336 7.0032 7.1482 6.3990 6.4810 11.0816 11.0320 4.5478 4.5463 1.0572 1.0573 1.0350 1.0358 1.0687 1.0687 1.0946 1.0946 1.0996 1.0999 1.0997 1.0997 1.1053 1.1053 1.0599 1.0599 1.0883 1.0885 1.0872 1.0872 1.0940 1.0940 1.0958 1.0958 1.0963 1.0963 1.1157 1.1157
irintensity: 0.0985 0.0501 0.1364 0.7001 0.8164 1.9816 0.2739 0.6431 2.6141 0.2395 3.9008 0.7127 0.0362 0.6881 3.6005 1.0554 0.0350 12.4975 2.5442 1.7068 1.5191 1.7111 0.0008 2.4405 6.8867 5.5697 3.8739 9.6665 2.0797 0.4598 0.2262 0.0239 0.2541 2.2533 1.0035 1.0553 0.4773 3.3465 2.0334 1.1110 8.4983 0.3154 4.6750 1.3200 0.0196 0.0602 30.1452 28.2362 19.0416 0.1210 1.5180 1.0727 7.8985 2.6190 26.0716 3.7339 1.7884 13.7463 19.3661 15.7750 2.7444 1.1537 1.4929 24.4274 4.7159 40.4313 67.7351 13.4522 4.9293 118.8551 79.2858 16.4445 1.6440 0.0050 2.1918 1.1195 0.1223 26.6906 45.5155 30.1317 3.8435 36.9278 53.2555 7.5163 9.8373 39.4783 32.9111 14.5880 20.4362 16.5391 31.9460 14.6349 38.3921 0.0099 12.5505 4.1784 760.8437 402.8825 15.9684 150.5614 57.6629 2.1760 5.5952 38.4267 212.8121 136.1556 70.9777 9.9385 3.1757 51.2933 30.1666 3.9915 0.0045 25.3608 5.5009 5.3520 10.8796 23.9780 8.5876 4.2514 16.3236 123.9303 56.0474 1.1617 0.0191 13.8580 4.2169 107.4032 30.5667 2.1771 5.8518 0.2790 19.7087 212.6017 78.6203 9.4847 0.0652 125.5267 38.6034 270.4028 6.4019 25.7433 14.3224 54.1742 19.8030 26.7059 30.1865 11.1618 7.3449 57.3471 24.5450 9.1087 64.1458 45.4530 39.2282 13.3718 19.5828 4.6816 4.5014 1.6223 33.4151 8.6607 11.5284 18.1211 16.5667 3.3035 3.2685 13.6437 1.7166 7.3076 7.7132
temp: 298.150 k
press: 1.00000 atm
elementType: 8 8 8 8 8 8 6 6 6 6 6 6 6 6 6 6 6 6 6 6 6 6 6 6 6 6 6 6 6 6 6 1 1 1 1 1 1 1 1 1 1 1 1 1 1 1 1 1 1 1 1 1 1 1 1 1 1 1 1
symmnumber: 1
zpe: 1239074.5 jmol-1
zpe.correction: 0.471939 hartree
zpe.thermalcorrener: 0.503610 hartree
zpe.thermalcorrenthalpy: 0.504554 hartree
zpe.thermalcorrgfe: 0.401495 hartree
zpe.sumelectzpe: -1418.453626 hartree
zpe.sumelectthermal: -1418.421955 hartree
zpe.sumelectthermalent: -1418.421011 hartree
zpe.sumelectthermalfe: -1418.524070 hartree
dipole: -0.0019 -1.2813 0.0054
dipole: 1.2813
quadrupole: -227.2996 -167.3580 -165.0651
quadrupole: -0.0331 -13.1691 -0.0042
quadrupole: -40.7254 19.2162 21.5092 -0.0331 -13.1691 -0.0042
hfenergy: -1418.9255649 hartree
pointgroup: C01 [X(C25H28O6)]
dipole: 0.0004734 0.5041009 -0.0010785 debye
polarizability: 388.8592711|-0.2958724|288.2997632|21.2989389|0.1007403|240.5109748 unknown
InChI: InChI=1S/C25H28O6/c1-5-23(26)30-17-15-28-21-11-7-19(8-12-21)25(3,4)20-9-13-22(14-10-20)29-16-18-31-24(27)6-2/h5-14H,1-2,15-18H2,3-4H3
charge 0 multiplicity 1
59 atoms
O  4.833975 -0.394584 -0.444104
O  -4.828934 -0.373673 0.441618
O  6.294577 2.164791 -0.064641
O  -6.278802 2.192947 0.070967
O  8.524749 2.709994 -0.502731
O  -8.504281 2.751476 0.516062
C  -0.004971 -3.584047 -0.007928
C  1.266746 -2.701408 -0.08289
C  -1.272516 -2.695541 0.070908
C  -0.005419 -4.507684 1.247553
C  -0.009235 -4.502287 -1.267365
C  2.414915 -2.929571 0.720483
C  -2.422756 -2.91687 -0.731501
C  1.334571 -1.650368 -1.032365
C  -1.334668 -1.646786 1.023246
C  3.579223 -2.148042 0.581313
C  -3.583451 -2.130674 -0.588902
C  2.490498 -0.856562 -1.190677
C  -2.48695 -0.848316 1.18494
C  3.623767 -1.110523 -0.377976
C  -3.622205 -1.095201 0.37288
C  4.918729 0.699403 -1.417811
C  -4.908147 0.717738 1.418682
C  6.294681 1.324489 -1.289893
C  -6.281487 1.349176 1.293845
C  7.506787 2.808254 0.226077
C  -7.486947 2.84653 -0.214045
C  7.373282 3.592347 1.48031
C  -7.352619 3.629906 -1.468643
C  8.413846 4.314725 1.969998
C  -8.390292 4.358601 -1.955094
H  0.083581 -3.925316 2.182006
H  0.82082 -5.24164 1.209175
H  -0.954625 -5.070398 1.290714
H  0.937784 -5.068463 -1.313774
H  -0.838099 -5.233348 -1.231349
H  -0.096944 -3.915685 -2.199291
H  2.411082 -3.724021 1.47305
H  -2.423332 -3.709419 -1.486075
H  0.457467 -1.434441 -1.654012
H  -0.455944 -1.436548 1.644557
H  4.460885 -2.32428 1.205361
H  -4.466615 -2.301499 -1.21233
H  2.491751 -0.055675 -1.936409
H  -2.483884 -0.049251 1.932629
H  4.790555 0.300123 -2.44613
H  4.131714 1.455429 -1.224028
H  -4.780682 0.314779 2.445644
H  -4.118133 1.471032 1.226435
H  7.081087 0.554501 -1.205153
H  6.520563 1.966893 -2.16123
H  -6.5039 1.990025 2.167209
H  -7.07126 0.582809 1.207526
H  6.400348 3.548669 1.980237
H  -6.381457 3.580512 -1.971478
H  8.324661 4.892746 2.895474
H  9.374535 4.330589 1.441952
H  -8.300335 4.936395 -2.880637
H  -9.349294 4.380144 -1.424188
