program: Gaussian 09
title: 000090429
version: EM64L-G09RevD.01
frameworkgroup: C1[X(C9H8O4)]
method: RPBEPBE
basis: SDD
operation: Freq
keyword: #p
keyword: freq=noraman
keyword: PBEPBE/SDD
title: #p freq=noraman PBEPBE/SDD
converged: YES YES NO NO
title: Mulliken charges:
elementType: O O O O C C C C C C C C C H H H H H H H H
charge: -0.256679 -0.234149 -0.206735 -0.253362 0.345808 0.389588 -0.306388 -0.374452 -0.357431 -0.331863 -0.203613 0.289921 -0.501245 0.306328 0.269964 0.238677 0.278364 0.167564 0.247317 0.246930 0.245454
chargesum: 0.00000
title: Mulliken charges with hydrogens summed into heavy atoms:
elementType: O O O O C C C C C C C C C
charge: -0.256679 -0.234149 -0.206735 -0.253362 0.345808 0.389588 -0.000060 -0.104487 -0.118755 -0.053499 -0.036049 0.289921 0.238457
polarizability: 1.98589110e+02 -2.05934633e-02 1.04851223e+02 -2.02121726e-02 -1.90503581e-02 4.83707004e+01
1716.lowfreq: -8.0102 -3.2449 0.0005 0.0007 0.0008 10.3624 34.0469 42.8764 81.7479
frequency: 33.8936 42.8299 81.7443 107.3992 107.5988 162.2030 188.5750 202.1179 261.1036 314.2920 335.3386 348.5189 421.1336 471.0964 510.7737 613.0630 630.1449 668.3109 684.0832 723.5105 758.9331 830.5332 846.9092 852.5364 860.1647 968.4419 992.4111 1001.7054 1003.6783 1014.3994 1113.1093 1118.5905 1150.6320 1163.5840 1170.9154 1199.3127 1223.4492 1297.0871 1362.3962 1404.8301 1418.7704 1426.6478 1454.2794 1462.0269 1488.1292 1571.5756 1610.2326 1620.9257 1638.7386 2872.0779 3010.1968 3115.0880 3128.8456 3154.1006 3160.1035 3178.2547 3206.4949
redmass: 5.4803 5.5685 1.1898 5.2891 5.3262 3.6127 6.7770 3.5864 6.7417 4.3766 3.9401 7.1927 2.9373 7.0718 2.7892 7.1519 7.0793 8.3625 12.1270 3.6411 5.8938 5.5667 1.3197 1.3607 8.2538 1.4219 1.4073 4.2869 1.5874 3.8820 1.3041 1.2539 1.5977 1.7293 3.8203 2.0850 3.5520 1.2895 1.9912 2.5211 3.1780 1.1989 1.0490 1.0520 2.5293 8.0470 6.3048 7.0618 9.4811 1.0849 1.0298 1.1053 1.0909 1.0893 1.1048 1.0968 1.0943
irintensity: 1.3132 0.6340 1.6140 1.1379 8.9724 0.3216 12.2859 7.7519 12.0571 4.3911 5.0683 18.2015 1.1928 0.5789 19.9687 0.8931 22.0751 0.2306 21.2182 0.0092 5.7582 48.7290 45.6408 37.5173 40.2912 8.9330 0.1561 17.3624 4.0830 2.0403 18.7544 0.5407 337.1636 551.1414 771.3138 30.3262 170.6282 3.9535 1.4206 1.1327 39.8956 46.8274 16.2165 14.8981 60.4235 179.8985 182.1731 57.8560 199.4135 125.2187 35.2207 23.4236 8.9670 0.3235 12.8111 2.7249 3.5474
temp: 298.150 k
press: 1.00000 atm
elementType: 8 8 8 8 6 6 6 6 6 6 6 6 6 1 1 1 1 1 1 1 1
symmnumber: 1
zpe: 399300.5 jmol-1
zpe.correction: 0.152086 hartree
zpe.thermalcorrener: 0.164368 hartree
zpe.thermalcorrenthalpy: 0.165312 hartree
zpe.thermalcorrgfe: 0.111979 hartree
zpe.sumelectzpe: -647.691724 hartree
zpe.sumelectthermal: -647.679441 hartree
zpe.sumelectthermalent: -647.678497 hartree
zpe.sumelectthermalfe: -647.731830 hartree
dipole: -4.7070 1.2604 -0.0051
dipole: 4.8728
quadrupole: -78.0969 -72.2669 -75.6503
quadrupole: 5.9601 -0.0163 -0.0321
quadrupole: -2.7589 3.0711 -0.3122 5.9601 -0.0163 -0.0321
hfenergy: -647.8438093 hartree
pointgroup: C01 [X(C9H8O4)]
dipole: 1.8314368 0.3817306 0.4188821 debye
dipolederiv: -2.6713737 -0.1026489 -0.2637478 -0.4219991 -0.3448104 -0.1534499 -0.4950675 -0.1294921 -0.3069114 -1.9261811 0.1531799 -0.0126122 0.4688604 -0.4328347 -0.0632493 0.2083709 -0.0869962 -0.3427884 -1.2091485 -0.0430103 -0.0984497 -0.3758673 -0.4269776 -0.0953664 -0.3403691 -0.0697944 -0.4123416 -0.8168058 0.0066066 -0.0333865 -0.140633 -0.7031522 -0.2896019 -0.1401568 -0.2790422 -0.5264184 1.8270882 -0.0456955 0.0978454 -0.3237239 0.1989919 0.0406216 -0.1016501 0.0615477 0.1464308 -1.0190109 0.0824425 -0.0191016 0.2760563 -0.1128284 -0.0665038 0.1211287 -0.0812974 -0.0417685 -0.451003 0.1076536 0.055097 0.3031904 -0.1720977 0.0034527 0.1966223 -0.0113426 -0.1375557 -0.5305601 -0.0925673 -0.0951292 -0.1747728 -0.0310376 0.0825646 -0.1548745 0.0889743 -0.1108918 0.3268545 -0.0965144 -0.0339986 0.0712143 0.0231738 0.1261758 0.0876877 0.1129378 -0.0544317 0.2565921 0.0542455 0.0667384 -0.1744194 0.007399 0.064813 -0.0990703 0.0824817 -0.0481197 1.8917857 -0.0610895 0.0929087 -0.0509959 0.5246489 0.2971871 0.1006693 0.2964234 0.3327798 3.1455213 -0.0667444 0.1639303 0.2824635 1.0372028 0.5096315 0.4181506 0.4840583 0.7387255 0.8791825 0.0174585 0.0555973 0.1668632 0.2402982 -0.0160695 0.1675602 -0.0284836 0.2706442 0.1521697 -0.0362561 -0.0291672 -0.0412485 0.1170891 -0.052777 -0.033059 -0.0524485 0.1445443 0.0787899 0.0528197 0.0309485 0.056764 0.0574699 -0.0805808 0.033911 -0.0808764 0.1184057 0.0483929 0.0682762 0.0414512 0.0500076 0.0162848 -0.0960976 0.0282986 -0.0946516 0.0874989 0.0623409 -0.0606261 -0.0512243 -0.0212756 0.0794591 -0.0576882 -0.0227514 -0.0607859 0.1108433 0.0120564 0.0025955 -0.005487 0.1346457 -0.1440288 -0.1722853 0.0902789 -0.1823981 -0.0178382 -0.002161 -0.0104715 0.0301032 -0.0745563 0.1000964 0.0000123 -0.0771625 0.0148219 -0.1083755 -0.0054873 0.0086608 -0.0203018 -0.1141232 -0.0729192 0.0726286 -0.0449591 0.0735426 0.0618242 -0.0490427 0.0616852 0.0279858 0.1035496 0.0385729 -0.0534177 0.0564422 -0.0571788 0.0957442 unknown
polarizability: 197.9210753|-2.9807923|85.4893514|9.2490244|26.6688689|68.4006063 unknown
InChI: InChI=1S/C9H8O4/c1-12-9(11)13-8-4-2-7(6-10)3-5-8/h2-6H,1H3
charge 0 multiplicity 1
21 atoms
O  1.564149 -0.666173 -0.296129
O  3.763423 -0.654037 -0.118232
O  -4.911906 -0.253427 -0.496249
O  2.592523 1.03428 1.007848
C  0.199706 -0.292828 -0.13094
C  -2.568884 0.174226 -0.004497
C  -0.269787 0.804288 0.62917
C  -0.685203 -1.156031 -0.824965
C  -1.662563 1.022231 0.680395
C  -2.065689 -0.92142 -0.760522
C  -4.025317 0.437794 0.074188
C  2.631078 0.020499 0.280194
C  5.034831 -0.079903 0.391163
H  0.425869 1.456433 1.157638
H  -0.265467 -1.98831 -1.396658
H  -2.048956 1.867293 1.263765
H  -2.776918 -1.56817 -1.284737
H  -4.306993 1.325406 0.696511
H  5.034793 -0.072184 1.493587
H  5.165146 0.947835 0.013922
H  5.812467 -0.748104 -0.001653
