program: Gaussian 09
title: 000090425
version: EM64L-G09RevD.01
frameworkgroup: C1[X(C6H6N4O3S)]
method: RPBEPBE
basis: SDD
operation: Freq
keyword: #p
keyword: freq=noraman
keyword: PBEPBE/SDD
title: #p freq=noraman PBEPBE/SDD
converged: YES YES NO NO
title: Mulliken charges:
elementType: S O O O N N N N C C C C C C H H H H H H
charge: 0.329332 -0.308750 -0.213791 -0.219669 -0.311374 -0.045440 0.033764 0.090154 -0.301169 -0.467871 0.226304 -0.152469 -0.075005 -0.214319 0.238339 0.238359 0.245399 0.245332 0.360537 0.302338
chargesum: 0.00000
title: Mulliken charges with hydrogens summed into heavy atoms:
elementType: S O O O N N N N C C C C C C
charge: 0.329332 -0.308750 -0.213791 -0.219669 0.049163 -0.045440 0.033764 0.090154 0.175529 0.022860 0.226304 -0.152469 -0.075005 0.088019
polarizability: 2.44104247e+02 -5.20764966e+00 1.22342394e+02 9.55068561e-02 -1.01832632e-01 5.35187622e+01
1716.lowfreq: -6.9470 -0.0020 0.0014 0.0024 1.5046 3.4047 23.5565 40.6874 80.3271
frequency: 23.5159 40.6693 80.3271 81.7625 88.3008 115.9689 164.6016 236.9179 250.6112 288.3761 295.3126 388.9144 463.0866 481.6175 562.8272 571.4139 599.6244 645.1968 664.5442 672.4950 702.0014 715.9734 739.5852 792.7808 814.7937 859.0715 885.7896 911.7867 939.5263 974.3832 1053.0562 1078.7940 1080.5250 1158.6337 1171.6745 1203.6451 1217.7563 1240.6720 1298.3022 1300.4970 1314.0353 1341.2715 1472.4744 1473.3327 1487.4754 1511.9774 1566.6542 1663.5563 3019.5834 3040.1363 3071.0328 3114.3753 3216.2533 3547.0348
redmass: 7.2983 6.4057 7.2173 2.1192 12.0503 7.0863 9.5871 4.9918 10.6342 9.4481 5.8960 11.6413 13.8223 4.1953 1.4931 14.4148 6.1539 3.8375 8.2794 11.2091 7.3941 10.0185 9.3756 7.6795 1.1701 8.8715 1.4344 4.6211 6.0394 5.0510 11.8635 1.5943 3.5812 1.0964 4.1728 1.0988 5.4634 1.6583 4.9886 1.3881 1.3287 13.5604 5.4051 1.1102 1.0957 1.8600 6.8129 8.3504 1.0587 1.0581 1.1078 1.1116 1.0963 1.0765
irintensity: 0.2615 0.0862 0.1222 0.8319 0.0128 3.0842 3.4149 4.6221 3.6284 1.7996 14.3677 1.7111 1.8240 7.1150 60.2924 17.9781 0.1269 73.5954 3.9421 7.8360 15.1648 16.0909 4.7724 3.1219 0.6488 3.6612 15.6424 132.3476 64.4826 40.9828 4.6659 0.0488 74.9740 0.6102 278.2378 0.1455 450.3382 14.0898 39.1922 32.3821 20.5693 131.2635 201.4170 7.0955 5.0934 94.8265 1039.5761 332.7304 35.6852 64.4043 6.4207 31.5690 4.9365 98.1804
temp: 298.150 k
press: 1.00000 atm
elementType: 16 8 8 8 7 7 7 7 6 6 6 6 6 6 1 1 1 1 1 1
symmnumber: 1
zpe: 345089.9 jmol-1
zpe.correction: 0.131438 hartree
zpe.thermalcorrener: 0.144177 hartree
zpe.thermalcorrenthalpy: 0.145122 hartree
zpe.thermalcorrgfe: 0.089612 hartree
zpe.sumelectzpe: -1073.816977 hartree
zpe.sumelectthermal: -1073.804237 hartree
zpe.sumelectthermalent: -1073.803293 hartree
zpe.sumelectthermalfe: -1073.858803 hartree
dipole: -8.1783 -1.5880 -0.0079
dipole: 8.3311
quadrupole: -91.9252 -89.4472 -86.1813
quadrupole: 0.9220 -0.0968 0.0184
quadrupole: -2.7407 -0.2626 3.0033 0.9220 -0.0968 0.0184
hfenergy: -1073.9484148 hartree
pointgroup: C01 [X(C6H6N4O3S1)]
dipole: -3.2259296 0.5774194 -0.0571698 debye
dipolederiv: -0.2695841 -0.0855067 0.0031143 -0.3480581 -0.2906691 0.0275464 0.020173 0.029661 0.1585917 -1.3517408 0.2757164 -0.0234747 0.1451383 -0.6935238 0.0248099 -0.0181247 0.0265382 -0.2525034 -0.9180437 0.2033023 -0.0178182 0.5376167 -0.629504 0.0300159 -0.0392184 0.02767 -0.2369216 -0.7790786 -0.1663696 0.0080123 -0.4075168 -0.6565549 0.0254059 0.0244991 0.0271463 -0.2432306 -2.5885383 -0.0941256 -0.012606 0.3261065 -0.3781142 0.0078365 -0.0383103 0.004227 -0.2872801 -0.6674164 -0.0868628 0.0022788 -0.3901418 -0.7401722 0.0194018 0.0196283 0.0222159 -0.3148775 -1.1070708 0.0901177 -0.0113057 1.0329144 -0.6826782 0.0406 -0.0690622 0.0337919 -0.1838818 2.3974424 0.0121577 0.0122013 0.0429936 1.0178793 -0.0524074 0.0076071 -0.0527323 0.2429892 0.5949251 -0.0467355 0.0041514 0.2269849 0.051829 0.0175384 -0.0109973 0.0153418 0.3452291 0.329549 0.1273443 -0.0062106 0.0489504 0.2044322 0.002844 -0.0013942 0.0034008 0.2474127 2.3558214 0.0042569 0.0175516 0.4396224 1.1595506 -0.0476993 -0.0098823 -0.0517938 0.1958994 2.0961003 0.104648 0.0057502 -1.1755131 0.7811487 -0.0586754 0.0833538 -0.0491495 0.0609294 -1.2932727 -0.2133726 0.0070269 -0.6503978 0.1933648 -0.0225172 0.0372913 -0.0203118 -0.0976855 1.1090338 0.0012197 0.0058365 0.2365129 0.1244934 -0.0061411 -0.0109742 -0.0070425 0.0127181 -0.0542525 0.0279033 -0.0666967 0.0090387 0.0779487 0.036535 -0.1393682 0.0488098 -0.0584943 -0.0576234 0.0358075 0.0633186 0.0240964 0.067231 -0.049566 0.1377484 -0.0616465 -0.045089 -0.0435657 -0.0686426 0.0473489 -0.0033013 0.0364559 0.0714411 0.1182535 0.107291 -0.0432476 -0.0407292 -0.0712077 -0.0397455 -0.0138671 0.0166294 -0.0782849 -0.1175417 -0.1154005 -0.0269836 0.1869232 -0.0504592 0.0018149 -0.1310632 0.249739 0.0046844 0.0104727 0.0055198 0.340284 0.1011213 0.0008086 -0.0005482 0.0498841 0.0905143 0.006632 -0.0041538 0.0064633 0.1861414 unknown
polarizability: 243.9259492|6.973698|122.2396771|0.9124529|-4.3201497|53.7997765 unknown
InChI: InChI=1S/C6H6N4O3S/c11-10(12)4-3-8-6(14-4)9-5-7-1-2-13-5/h3,9H,1-2H2
charge 0 multiplicity 1
20 atoms
S  1.526227 1.455857 -0.096506
O  -3.489238 1.1839 -0.106394
O  4.576705 -1.143983 0.0934
O  4.502095 1.151451 -0.061539
N  -1.199951 0.884237 -0.069538
N  -2.722076 -1.036959 0.021268
N  0.337288 -0.980483 0.060794
N  3.939139 -0.017467 0.01431
C  -4.743814 0.357995 -0.072166
C  -4.220825 -1.121781 0.010767
C  -2.435159 0.225885 -0.044441
C  0.05635 0.31809 -0.026642
C  2.506675 -0.064739 0.009938
C  1.703272 -1.19889 0.081111
H  -5.305318 0.579001 -0.993741
H  -5.319371 0.675046 0.811991
H  -4.55871 -1.633236 0.928495
H  -4.540468 -1.726803 -0.855155
H  -1.275184 1.902556 -0.128448
H  2.092864 -2.21468 0.150697
