program: Gaussian 09
title: 000090481
version: EM64L-G09RevD.01
frameworkgroup: C1[X(C18H22O2)]
method: RPBEPBE
basis: SDD
operation: Freq
keyword: #pfreq=noraman
keyword: PBEPBE/SDD
title: #p freq=noraman PBEPBE/SDD
converged: YES YES NO NO
title: Mulliken charges:
elementType: O O C C C C C C C C C C C C C C C C C C H H H H H H H H H H H H H H H H H H H H H H
charge: -0.437392 -0.437385 -0.368625 -0.369166 -0.386147 -0.387333 -0.572604 -0.571366 0.516910 0.519605 -0.389467 -0.409344 -0.396870 -0.380245 -0.389607 -0.386008 -0.348491 -0.352893 0.276395 0.276788 0.194724 0.193746 0.194472 0.194135 0.210746 0.207733 0.210250 0.209165 0.205954 0.205060 0.205889 0.205408 0.231030 0.231559 0.233425 0.232768 0.215076 0.215309 0.247307 0.247340 0.351080 0.351070
chargesum: 0.00000
title: Mulliken charges with hydrogens summed into heavy atoms:
elementType: O O C C C C C C C C C C C C C C C C C C
charge: -0.086311 -0.086314 0.019844 0.019441 0.032332 0.032081 -0.161591 -0.160069 0.516910 0.519605 -0.158437 -0.177785 -0.163446 -0.147476 -0.174531 -0.170699 -0.101183 -0.105553 0.276395 0.276788
polarizability: 2.92942185e+02 -4.75813349e+00 1.88017139e+02 -3.71083686e+01 -5.69875901e+00 1.24472932e+02
1716.lowfreq: -4.6981 -0.0010 -0.0001 0.0004 3.5472 6.0742 9.7479 13.2711 23.4404
frequency: 8.5103 13.0779 23.0923 23.5952 46.9624 63.5375 79.1136 104.7202 129.2844 136.7583 138.5400 194.9973 212.8314 297.6189 300.0837 319.9498 344.5308 347.0534 348.9038 398.5142 402.8288 404.8698 410.9905 411.3996 439.2508 485.7790 503.6317 542.2121 550.7012 636.3976 636.4770 717.1983 718.2084 725.3331 741.5827 752.1458 759.9849 780.8787 805.9725 806.7488 823.1235 824.9641 836.9321 838.7566 861.2678 928.9501 930.8201 957.8569 958.2403 960.5688 994.5029 1002.0359 1004.3608 1008.0983 1057.2914 1058.5334 1070.8297 1076.0734 1078.4217 1114.9786 1121.5339 1142.1381 1142.6961 1178.2960 1178.7270 1211.3564 1213.6330 1215.2698 1216.0580 1244.6771 1244.8515 1257.4360 1263.9846 1277.7927 1288.6750 1291.3881 1305.3924 1320.1804 1320.9496 1332.6786 1346.9535 1353.7106 1390.5039 1390.5425 1425.4766 1425.6782 1462.2230 1463.4128 1467.1523 1474.3277 1483.6922 1488.8767 1504.2042 1504.6305 1597.7976 1598.2986 1626.9248 1627.2028 2950.1328 2954.8343 2966.2406 2967.2568 2975.3384 2977.1912 2986.7229 3001.7670 3013.2234 3023.1760 3042.4839 3049.2478 3106.5611 3108.0980 3121.6346 3122.6305 3132.7472 3135.0636 3167.8201 3168.1844 3581.9891 3582.2377
redmass: 4.6932 3.9033 4.5144 4.2853 6.3508 2.9845 1.7871 5.3544 2.2490 5.2253 2.0420 4.4862 4.8860 2.8245 2.8149 4.4401 1.1415 1.1483 4.3448 3.7797 3.1887 3.2745 2.9421 3.0386 4.0599 4.2071 3.4816 3.1595 2.6977 6.7508 6.7619 3.6632 3.7540 1.0658 1.1088 4.1872 4.1271 1.2098 1.4418 1.4348 3.1585 2.4379 1.8778 2.1295 1.3174 1.3943 1.3715 1.3536 1.3612 1.3398 4.5542 3.5688 2.8235 3.2330 1.9794 2.0060 4.4142 1.3325 2.1970 1.3351 1.2168 1.3644 1.3563 1.1119 1.1106 1.5439 1.2817 2.0434 2.1610 2.9158 2.9121 1.3350 1.3838 1.1136 1.1226 1.1071 1.3972 1.2543 1.2588 1.4325 1.4912 1.6430 6.0093 6.0705 2.7983 2.8043 1.0789 1.0720 1.0847 1.1017 1.1029 1.1015 2.7630 2.7765 6.4311 6.4304 6.4643 6.4747 1.0590 1.0591 1.0594 1.0590 1.0598 1.0592 1.0975 1.0997 1.1013 1.1036 1.1050 1.1046 1.0872 1.0874 1.0898 1.0899 1.0961 1.0961 1.0952 1.0951 1.0660 1.0660
irintensity: 0.0566 0.0035 0.6810 0.6280 0.0275 0.0861 0.0617 0.9128 0.0639 0.0063 0.0063 0.0027 0.2027 6.0479 0.3540 0.3246 141.5393 117.9904 31.8889 2.2453 18.9515 0.5905 0.6734 2.8245 0.1815 0.3165 34.8424 48.1496 0.2097 0.6534 0.8533 2.2873 0.9183 8.8751 0.0867 0.0914 36.7211 0.6824 58.0564 1.8608 0.6817 28.1030 5.7904 56.7776 0.2739 0.0067 0.0143 0.0163 0.3513 0.1783 0.4755 0.0274 8.5027 0.0005 15.7767 1.8773 0.5335 6.0466 0.2170 85.5334 16.6498 398.0465 20.3233 8.6186 3.6936 0.0873 12.5283 10.0861 10.7780 29.3705 26.7736 1.9757 0.0033 0.4858 0.2230 0.0141 3.8304 1.5746 23.0416 0.5118 1.2208 0.0028 17.0389 10.8367 15.7731 10.9562 0.3075 0.0040 0.0367 0.6019 0.0347 24.9155 199.0699 19.1248 9.8549 7.7229 25.6729 23.1056 0.0017 23.4192 0.3175 3.3176 7.9516 180.4361 0.0148 4.7257 0.0805 1.6054 0.0109 163.3232 21.6143 20.7721 20.5450 21.3515 15.6145 17.1793 7.3252 7.1268 41.0505 32.8637
temp: 298.150 k
press: 1.00000 atm
elementType: 8 8 6 6 6 6 6 6 6 6 6 6 6 6 6 6 6 6 6 6 1 1 1 1 1 1 1 1 1 1 1 1 1 1 1 1 1 1 1 1 1 1
symmnumber: 1
zpe: 925220.4 jmol-1
zpe.correction: 0.352398 hartree
zpe.thermalcorrener: 0.372481 hartree
zpe.thermalcorrenthalpy: 0.373425 hartree
zpe.thermalcorrgfe: 0.298515 hartree
zpe.sumelectzpe: -848.077842 hartree
zpe.sumelectthermal: -848.057759 hartree
zpe.sumelectthermalent: -848.056815 hartree
zpe.sumelectthermalfe: -848.131725 hartree
dipole: -0.1316 -3.1091 0.3699
dipole: 3.1338
quadrupole: -125.8855 -107.0819 -126.0119
quadrupole: -0.0857 -2.6928 -2.2728
quadrupole: -6.2257 12.5778 -6.3521 -0.0857 -2.6928 -2.2728
hfenergy: -848.4302398 hartree
pointgroup: C01 [X(C18H22O2)]
dipole: -0.0494949 1.2317614 0.0212764 debye
polarizability: 292.4348481|-0.5405641|188.3818884|38.5374319|2.9679095|124.6155199 unknown
InChI: InChI=1S/C18H22O2/c19-17-11-7-15(8-12-17)5-3-1-2-4-6-16-9-13-18(20)14-10-16/h7-14,19-20H,1-6H2
charge 0 multiplicity 1
42 atoms
O  8.422758 -0.028813 0.883245
O  -8.416576 -0.155226 -0.881907
C  0.526248 -0.027646 -0.56748
C  -0.523283 0.084587 0.561241
C  1.981298 0.020739 -0.051387
C  -1.977988 0.033784 0.044443
C  3.031215 -0.082288 -1.192967
C  -3.029009 0.136013 1.184802
C  4.464013 -0.048398 -0.682175
C  -4.46189 0.082367 0.675235
C  5.13129 1.18177 -0.45595
C  -5.222861 1.263087 0.490808
C  5.161395 -1.246412 -0.372508
C  -5.066012 -1.156264 0.327713
C  6.444114 1.224034 0.063718
C  -6.538053 1.219964 -0.025057
C  6.47173 -1.226622 0.146582
C  -6.375499 -1.221538 -0.187462
C  7.112644 0.013669 0.36585
C  -7.111726 -0.027639 -0.365205
H  0.365529 -0.974299 -1.124898
H  0.368096 0.792668 -1.299019
H  -0.363526 1.03171 1.118166
H  -0.364557 -0.735232 1.293167
H  2.150002 -0.803837 0.670635
H  2.148012 0.962789 0.509538
H  -2.147819 0.85694 -0.678921
H  -2.141848 -0.90937 -0.515405
H  2.850325 -1.020835 -1.753451
H  2.85936 0.750165 -1.904399
H  -2.848039 -0.690034 1.901966
H  -2.858733 1.079746 1.739508
H  4.620737 2.123297 -0.693628
H  -4.78439 2.232906 0.756055
H  4.671383 -2.21269 -0.544968
H  -4.50245 -2.087157 0.468228
H  6.942253 2.189313 0.226176
H  -7.109815 2.148564 -0.155727
H  7.010355 -2.149767 0.380723
H  -6.842176 -2.175463 -0.450851
H  8.783345 0.885325 0.996946
H  -8.847753 0.731389 -0.963276
