program: Gaussian 09
title: 000090443
version: EM64L-G09RevD.01
frameworkgroup: C1[X(C15H12O5)]
method: RPBEPBE
basis: SDD
operation: Freq
keyword: #pfreq=noraman
keyword: PBEPBE/SDD
title: #p freq=noraman PBEPBE/SDD
converged: YES YES NO NO
title: Mulliken charges:
elementType: O O O O O C C C C C C C C C C C C C C C H H H H H H H H H H H H
charge: -0.283534 -0.182172 -0.379000 -0.491105 -0.427310 -0.219797 -0.544689 0.570172 0.082025 0.111723 0.256605 -0.512749 -0.467938 0.187534 -0.414182 0.181110 -0.441714 -0.315731 -0.172605 0.132680 0.242406 0.261905 0.249721 0.249498 0.237105 0.260257 0.223940 0.253811 0.233555 0.358250 0.375143 0.385089
chargesum: 0.00000
title: Mulliken charges with hydrogens summed into heavy atoms:
elementType: O O O O O C C C C C C C C C C C C C C C
charge: -0.283534 -0.182172 -0.020751 -0.115962 -0.042221 0.022609 -0.033063 0.570172 0.082025 0.111723 0.256605 -0.263251 -0.230834 0.187534 -0.153925 0.181110 -0.217774 -0.061920 0.060950 0.132680
polarizability: 2.73047301e+02 5.01244783e+00 1.72098373e+02 1.10828300e+00 7.27754772e+00 1.11507485e+02
1716.lowfreq: -8.4951 0.0005 0.0007 0.0008 1.8909 5.8786 17.5899 35.1016 51.6621
frequency: 17.2304 35.0664 51.6360 70.8533 107.5701 152.0019 165.6991 216.3723 224.7747 237.4359 262.9972 273.5459 278.6348 281.7516 365.2331 389.4168 414.0334 427.9498 430.6012 438.4446 458.7493 479.1548 487.6055 516.8075 529.7750 552.1747 573.9170 581.4795 609.4547 626.1395 641.3705 651.8813 719.5784 730.4054 754.3749 776.6817 785.2808 800.0646 819.6729 856.4464 857.2096 859.2861 934.7095 938.6386 963.6842 972.7885 1003.3779 1027.0334 1054.7498 1076.3569 1085.8926 1126.8999 1151.9326 1161.9798 1171.5683 1179.2821 1185.1300 1211.5258 1230.9473 1249.9224 1261.7982 1273.1784 1293.0123 1317.0995 1340.7147 1348.5628 1387.0609 1419.6693 1427.5955 1435.4245 1437.6374 1471.9205 1523.3113 1576.1402 1597.0943 1615.2978 1618.5164 1627.0218 2975.1411 2994.1094 3085.3369 3121.9484 3132.3342 3135.1011 3152.7762 3174.9398 3180.9131 3524.1327 3540.8113 3623.2654
redmass: 5.3162 6.8020 6.9146 6.7424 4.0248 5.6907 6.4621 4.8355 5.1143 5.9766 4.0666 2.5422 1.8011 5.1573 6.5460 6.8436 3.5684 4.1801 1.2196 3.0320 5.1658 4.0057 1.1230 5.8801 3.8189 5.8637 4.2891 6.0591 4.5008 4.8425 4.0770 4.8605 3.6370 2.0729 4.3751 4.9692 2.6951 4.6151 1.4316 1.6182 1.6083 2.8825 2.8904 1.5625 1.3182 2.8966 4.2911 5.4893 3.0704 2.3051 1.8410 1.3733 1.3853 1.3085 1.3037 1.3366 1.4736 2.1294 2.2699 1.4625 2.3074 1.6991 2.8262 1.4636 1.8909 2.0960 7.0566 3.2171 1.1773 2.8707 3.2996 2.9245 3.3569 7.3092 8.1826 7.1540 7.2928 7.1968 1.0825 1.0672 1.0963 1.0889 1.0911 1.0905 1.0922 1.0952 1.0969 1.0648 1.0657 1.0666
irintensity: 1.3095 0.8313 0.3573 4.6603 7.4782 0.3260 2.9782 0.4386 0.7000 6.7543 41.9216 51.4072 80.8764 9.7664 3.9661 10.7651 9.7855 9.2534 100.0044 20.4079 10.9367 7.6926 124.2833 2.6233 1.0051 15.4346 11.8028 25.4786 0.9539 9.2155 2.0852 3.3400 0.9321 59.4956 25.6344 4.6200 33.8855 26.4366 35.3851 8.0450 40.1293 11.6685 41.5646 14.0277 1.2628 1.7442 287.2549 43.1778 16.1188 145.7226 8.3631 15.1917 10.8454 39.1722 39.9322 27.0282 283.5251 32.2020 75.7724 155.0296 40.8368 27.4885 233.1704 4.2878 8.4599 126.8799 4.5155 4.8107 25.7544 69.6830 140.9930 25.2618 93.2416 62.3401 317.5334 127.3884 65.2963 14.7837 14.9386 13.3599 6.5064 11.1124 10.3457 3.8465 16.3139 5.9091 5.6835 97.0237 31.3720 50.1796
temp: 298.150 k
press: 1.00000 atm
elementType: 8 8 8 8 8 6 6 6 6 6 6 6 6 6 6 6 6 6 6 6 1 1 1 1 1 1 1 1 1 1 1 1
symmnumber: 1
zpe: 621143.3 jmol-1
zpe.correction: 0.236581 hartree
zpe.thermalcorrener: 0.253638 hartree
zpe.thermalcorrenthalpy: 0.254582 hartree
zpe.thermalcorrgfe: 0.190750 hartree
zpe.sumelectzpe: -953.483037 hartree
zpe.sumelectthermal: -953.465980 hartree
zpe.sumelectthermalent: -953.465036 hartree
zpe.sumelectthermalfe: -953.528868 hartree
dipole: 1.8433 4.4060 0.8191
dipole: 4.8458
quadrupole: -104.6839 -118.0414 -110.9484
quadrupole: 9.4909 -8.7890 9.6307
quadrupole: 6.5407 -6.8168 0.2762 9.4909 -8.7890 9.6307
hfenergy: -953.7196176 hartree
pointgroup: C01 [X(C15H12O5)]
dipole: 0.7641609 -1.4481436 -0.9765117 debye
polarizability: 273.2236623|-2.6984628|156.9764667|-1.1569617|27.06325|126.4530297 unknown
InChI: InChI=1S/C15H12O5/c16-9-5-4-8(6-11(9)18)14-7-12(19)15-10(17)2-1-3-13(15)20-14/h1-6,14,16-18H,7H2
charge 0 multiplicity 1
32 atoms
O  0.434355 -0.911605 0.007701
O  2.465226 2.734888 0.424233
O  4.800333 1.331771 0.184432
O  -4.317099 -0.761242 -2.058413
O  -5.902762 -0.105459 0.020332
C  -0.207611 0.264789 0.679369
C  0.37229 1.551276 0.067336
C  -1.704131 0.119633 0.515167
C  2.599597 0.31643 0.085434
C  1.899685 1.622311 0.228952
C  1.829783 -0.885195 -0.079601
C  -2.251324 -0.283451 -0.730371
C  -2.573115 0.436458 1.585498
C  4.025851 0.186419 0.008021
C  2.433152 -2.132897 -0.351668
C  -3.644144 -0.359655 -0.88083
C  4.635655 -1.062305 -0.256108
C  -3.976001 0.372316 1.424897
C  3.834981 -2.209513 -0.443359
C  -4.518703 -0.0262 0.189995
H  0.064049 0.211883 1.754347
H  -0.072755 2.442934 0.539916
H  0.121353 1.585739 -1.01212
H  -1.579807 -0.563973 -1.550849
H  -2.157681 0.736866 2.554272
H  1.796182 -3.013814 -0.463726
H  5.728915 -1.136082 -0.312456
H  -4.657865 0.616202 2.244329
H  4.31286 -3.173706 -0.646144
H  5.761701 1.112998 0.074657
H  -3.68941 -1.004262 -2.779848
H  -6.094562 -0.409554 -0.906093
