program: Gaussian 09
title: 000090406
version: EM64L-G09RevD.01
frameworkgroup: C1[X(C6H7NO2)]
method: RPBEPBE
basis: SDD
operation: Freq
keyword: #pfreq=noraman
keyword: PBEPBE/SDD
title: #p freq=noraman PBEPBE/SDD
converged: NO NO NO NO
title: Mulliken charges:
elementType: O O N C C C C C C H H H H H H H
charge: -0.422952 -0.350646 -0.005500 0.335615 -0.304544 -0.391596 0.310407 -0.293062 -0.747418 0.239566 0.276361 0.266331 0.256224 0.256349 0.212277 0.362589
chargesum: 0.00000
title: Mulliken charges with hydrogens summed into heavy atoms:
elementType: O O N C C C C C C
charge: -0.060363 -0.350646 -0.005500 0.335615 -0.064978 -0.115235 0.310407 -0.026731 -0.022569
polarizability: 1.12612438e+02 -5.30454991e+00 9.34072579e+01 9.11412085e-03 2.99504026e-03 3.67758181e+01
1716.lowfreq: -14.4418 0.0003 0.0004 0.0006 7.6166 13.5876 133.3218 155.1040 213.9549
frequency: 133.3209 155.1026 213.9520 300.7838 317.7608 334.4199 353.3317 446.0374 449.2697 513.2022 575.2437 608.5909 685.9798 727.7977 760.7148 795.8589 814.9954 933.0243 949.7536 998.7824 1046.2522 1114.3103 1132.5218 1179.2772 1217.1383 1269.8846 1293.1051 1295.7370 1389.6105 1409.5391 1440.5208 1468.6870 1503.6919 1565.8811 1622.6402 2987.4968 3061.6021 3109.1007 3160.4377 3184.7487 3196.4763 3579.9781
redmass: 3.5490 1.0651 5.4691 3.0475 3.5186 5.5548 1.1672 2.7682 5.7198 5.9284 6.1516 4.1882 2.8973 6.8593 4.7265 1.3194 1.7622 1.3103 2.3581 1.8607 1.4879 1.4708 1.7714 1.6963 2.6139 3.0226 3.8402 2.2417 2.0382 1.3151 1.0445 1.1722 3.6457 5.7793 6.2228 1.0370 1.0962 1.1002 1.0906 1.0929 1.0963 1.0662
irintensity: 4.1609 0.1053 2.2804 3.8463 0.2949 21.3542 150.9891 18.8278 2.6139 4.5662 5.7246 10.0853 2.5701 7.9923 0.7362 4.9220 81.9214 0.1003 3.7058 31.5983 6.7396 26.8188 270.7539 13.2154 19.9516 11.5713 45.4580 4.1319 5.8521 21.3563 13.7888 24.7399 111.8415 49.8558 49.2818 15.7476 11.0319 13.0911 8.2479 0.9824 0.8327 47.8711
temp: 298.150 k
press: 1.00000 atm
elementType: 8 8 7 6 6 6 6 6 6 1 1 1 1 1 1 1
symmnumber: 1
zpe: 318784.2 jmol-1
zpe.correction: 0.121418 hartree
zpe.thermalcorrener: 0.129505 hartree
zpe.thermalcorrenthalpy: 0.130449 hartree
zpe.thermalcorrgfe: 0.089103 hartree
zpe.sumelectzpe: -437.316905 hartree
zpe.sumelectthermal: -437.308819 hartree
zpe.sumelectthermalent: -437.307874 hartree
zpe.sumelectthermalfe: -437.349221 hartree
dipole: -1.5953 1.5967 -0.0006
dipole: 2.2570
quadrupole: -51.4508 -50.1097 -54.8620
quadrupole: 12.5722 0.0019 0.0026
quadrupole: 0.6900 2.0311 -2.7212 12.5722 0.0019 0.0026
hfenergy: -437.4383239 hartree
pointgroup: C01 [X(C6H7N1O2)]
dipole: 0.6541669 0.600492 0.0005138 debye
dipolederiv: -1.38258 0.3216272 -0.0001833 0.3789664 -0.1573046 0.0000251 -0.0000283 0.0000261 -0.4282194 -0.6821492 -0.3114565 -0.0001695 -0.4004618 -0.778267 -0.0001925 -0.0001584 -0.0001951 -0.3259375 0.5093668 0.3159045 0.0003754 0.5871283 0.7014041 0.0003022 0.0003706 0.0003228 0.1292005 0.3588308 -0.1004707 0.0000333 -0.353974 -0.3579627 -0.0001097 0.0005457 -0.0004211 -0.048186 0.2077773 0.1391792 0.0001078 0.0448667 0.1847679 0.0000001 0.0000007 0.0000922 -0.109658 -0.5223434 -0.0719957 -0.0001527 -0.095206 0.0149099 -0.0000198 -0.0001138 0.0000167 -0.2172876 1.3673243 -0.2652425 0.0002053 -0.3825346 0.2788021 -0.0000035 0.0001565 0.0000295 0.1254185 -0.347529 -0.0285786 -0.0000519 0.2994609 -0.1367764 0.0000827 -0.000014 0.0000288 -0.1978719 -0.189727 0.0286267 0.0000703 -0.0899248 0.1431243 0.0002043 -0.0007361 0.0007985 0.058284 0.0815574 0.0755441 0.0000457 0.0602395 -0.0502995 -0.0000305 0.000041 -0.0000583 0.1516102 0.038246 0.0225125 -0.0000185 0.0429548 0.0202857 -0.0000294 -0.0000621 -0.0000617 0.2055019 0.0288737 -0.0628249 -0.0000295 -0.0615004 0.0435047 -0.0000389 -0.0000304 -0.0000616 0.1894658 0.0290639 0.0207321 -0.0472341 -0.0277886 0.0688893 -0.081592 -0.0838537 -0.0380157 -0.0220376 0.0297208 0.0204322 0.047019 -0.0287108 0.0681471 0.0822781 0.0836017 0.0382908 -0.020676 0.080629 -0.0092599 -0.0000306 0.1010949 -0.1273232 -0.0008708 0.0003124 -0.0007884 0.1146381 0.3929387 -0.0947297 0.0000133 -0.0746103 0.0840985 -0.0000054 -0.0000317 -0.0000035 0.395755 unknown
polarizability: 113.0342397|4.4563888|92.9854484|0.0234023|0.0122111|36.7758261 unknown
InChI: InChI=1S/C6H7NO2/c1-5-2-3-6(8)4-7(5)9/h2-4,8H,1H3
charge 0 multiplicity 1
16 atoms
O  2.957339 -0.363923 0.000214
O  -1.65101 -1.760575 -0.00115
N  -0.745427 -0.779915 -0.000548
C  -1.162874 0.562426 -0.000197
C  -0.18007 1.568879 0.00011
C  0.612675 -1.091817 -0.000279
C  1.58576 -0.080061 0.000061
C  1.200589 1.281531 0.000202
C  -2.647413 0.782117 -0.000323
H  -0.520234 2.608661 0.000316
H  0.829525 -2.162632 -0.000491
H  1.960784 2.064885 0.000435
H  -3.113683 0.308279 -0.883733
H  -3.114497 0.301623 0.87899
H  -2.877569 1.859876 0.003401
H  3.128104 -1.338853 0.000292
