program: Gaussian 09
title: 000090458
version: EM64L-G09RevD.01
frameworkgroup: C1[X(C18H30O2)]
method: RPBEPBE
basis: SDD
operation: Freq
keyword: #pfreq=noraman
keyword: PBEPBE/SDD
title: #p freq=noraman PBEPBE/SDD
converged: YES YES NO NO
title: Mulliken charges:
elementType: O O C C C C C C C C C C C C C C C C C C H H H H H H H H H H H H H H H H H H H H H H H H H H H H H H
charge: -0.439431 -0.435127 -0.386271 -0.384712 -0.384170 -0.391073 -0.382259 -0.369979 -0.372382 -0.391501 -0.353519 -0.534194 -0.356521 0.398870 -0.696920 0.155164 -0.372655 -0.571916 -0.387078 0.312436 0.194626 0.192121 0.195016 0.191291 0.193446 0.191769 0.197096 0.192926 0.192294 0.191060 0.196381 0.187643 0.188704 0.189481 0.227332 0.202766 0.187603 0.187321 0.199613 0.223716 0.194653 0.194622 0.209570 0.209572 0.214641 0.237841 0.207888 0.249060 0.352783 0.350402
chargesum: 0.00000
title: Mulliken charges with hydrogens summed into heavy atoms:
elementType: O O C C C C C C C C C C C C C C C C C C
charge: -0.086647 -0.084725 0.000476 0.001595 0.001045 -0.001051 0.001096 0.014045 0.005802 0.038598 0.021406 -0.110866 0.032753 0.398870 -0.063136 0.155164 -0.134814 -0.364029 -0.138018 0.312436
polarizability: 2.77575346e+02 -5.71000988e+00 1.84217375e+02 -2.41487079e+01 -6.04916611e+00 1.56034810e+02
1716.lowfreq: -9.9728 -3.1118 -0.0017 0.0005 0.0011 4.7271 13.0048 16.8060 18.8807
frequency: 10.4761 16.5468 18.7969 30.1393 46.2479 56.0658 57.7026 87.8005 92.4014 96.5204 123.6158 127.1240 129.3010 149.1032 151.2220 154.3670 202.9626 220.9655 226.1790 256.7220 288.0225 292.6455 315.7702 320.4732 330.8455 358.4838 393.3521 419.7689 450.6577 472.0196 484.8157 491.6465 523.7652 549.5715 610.7216 708.5826 718.2756 720.6122 724.5878 726.3215 736.5002 754.9135 775.7162 785.0663 793.0883 820.8114 829.4566 879.1719 886.8601 930.0574 944.9723 947.6791 979.2679 981.7533 984.8525 1015.8679 1021.4267 1025.1508 1047.2631 1061.9702 1067.9419 1074.5675 1079.9984 1080.5647 1084.3306 1098.5771 1122.7805 1134.8443 1154.3720 1179.9769 1180.4103 1198.5370 1201.8354 1219.0919 1225.4210 1229.9380 1249.5083 1256.1176 1268.7611 1276.4652 1280.7401 1281.3543 1285.0038 1289.9708 1293.6649 1295.5970 1298.9941 1305.2122 1311.9124 1326.2490 1340.1787 1349.5856 1352.3408 1355.3976 1355.5498 1386.4901 1400.8538 1423.3563 1458.5748 1458.7923 1461.5848 1462.3046 1464.8555 1465.1260 1469.0878 1473.7852 1475.6983 1478.6265 1483.1266 1486.7641 1488.3282 1517.4067 1606.6302 1631.0078 2947.0054 2947.6352 2948.3339 2949.9638 2950.4108 2953.5087 2958.1650 2962.9700 2967.3418 2970.4245 2972.5486 2980.7063 2981.5732 2983.4348 2987.2416 2992.9089 3000.9431 3011.1763 3021.0207 3027.7286 3034.3503 3041.4972 3055.3269 3067.0859 3069.3088 3095.9716 3129.9173 3177.8021 3582.2061 3585.0032
redmass: 3.1876 2.2030 4.5355 3.6739 4.6100 3.3387 1.6024 3.9191 2.3759 1.8697 4.0692 2.0786 2.1623 2.4302 2.1562 2.5995 3.7550 5.5438 1.1360 3.7421 2.7896 3.3507 1.1282 4.4976 1.2683 2.9904 3.9229 3.0817 2.8243 3.4935 3.7671 2.9987 4.7425 6.1724 3.6422 2.8744 1.0589 1.0681 2.4250 1.4242 1.1346 1.1546 2.5389 1.2144 2.2791 1.5099 1.2584 1.2607 1.9004 1.3322 1.3896 3.1226 3.0246 3.5361 1.6057 4.1706 2.4235 1.2967 3.2886 1.7637 2.7867 2.5284 2.1276 2.2134 2.4280 1.6215 2.8681 1.4586 1.1980 1.3647 1.8550 1.3845 1.4496 2.0673 1.4142 1.3409 1.3451 1.3187 1.2927 1.0194 1.2219 1.2892 1.1118 1.1177 1.1765 1.2453 2.0795 1.3471 1.2408 1.3958 1.4517 1.5465 1.7171 1.6272 1.6594 1.2172 6.1052 3.1630 1.0764 1.0737 1.0815 1.0703 1.0873 1.0794 1.0873 1.0845 1.0436 1.0878 1.0922 1.0963 1.0947 2.9689 6.7182 6.8640 1.0588 1.0586 1.0588 1.0592 1.0593 1.0595 1.0592 1.0586 1.0586 1.0365 1.0605 1.0924 1.0715 1.0916 1.0963 1.0993 1.1018 1.1032 1.1030 1.1025 1.1045 1.1045 1.1045 1.1007 1.0993 1.0911 1.0899 1.0950 1.0660 1.0661
irintensity: 0.3693 0.1035 0.1068 0.1964 0.4129 0.0676 0.0183 0.4756 0.1051 0.1259 0.5352 0.0712 0.0456 0.0406 0.0428 0.0824 0.0304 0.0187 0.0017 0.4935 4.5085 7.2146 150.1656 7.2079 89.3874 9.7102 1.0699 4.7171 24.1295 4.3723 16.7518 1.6777 6.3809 10.3437 10.8691 5.4460 17.3992 0.4656 3.6425 9.5438 0.8468 3.7150 1.2159 0.1253 25.5995 48.5911 5.6342 0.0913 5.0663 1.0524 0.1884 37.6455 0.6131 0.1977 1.1839 0.2908 4.4943 0.1043 1.2444 34.9467 1.6632 3.3122 0.8407 0.1482 1.1412 195.5457 22.0565 159.3148 49.1057 2.0364 0.6586 20.3613 7.7717 32.0703 1.3343 1.0005 3.4689 1.1262 3.1424 0.2582 1.3173 0.7105 1.2203 1.8252 1.4068 3.2029 17.3971 0.4166 36.9860 0.6881 0.6825 0.4658 0.4430 0.2363 0.0664 11.1624 3.8041 26.3042 0.1931 0.0394 1.0887 0.0072 2.5764 0.4194 1.1299 1.2811 12.1158 1.3984 0.9657 5.1184 41.2818 87.2981 76.4982 56.4292 3.3738 0.0050 1.6603 0.5429 1.3562 5.1063 0.7246 108.3223 190.6478 37.7300 16.5478 5.6258 53.5516 15.0518 6.1634 3.1261 1.7138 1.0881 6.4757 1.2116 1.2334 237.8232 99.2548 100.3801 56.1596 19.6006 13.0091 5.6937 25.0054 34.5209
temp: 298.150 k
press: 1.00000 atm
elementType: 8 8 6 6 6 6 6 6 6 6 6 6 6 6 6 6 6 6 6 6 1 1 1 1 1 1 1 1 1 1 1 1 1 1 1 1 1 1 1 1 1 1 1 1 1 1 1 1 1 1
symmnumber: 1
zpe: 1153850.5 jmol-1
zpe.correction: 0.439478 hartree
zpe.thermalcorrener: 0.463537 hartree
zpe.thermalcorrenthalpy: 0.464481 hartree
zpe.thermalcorrgfe: 0.380921 hartree
zpe.sumelectzpe: -852.771830 hartree
zpe.sumelectthermal: -852.747771 hartree
zpe.sumelectthermalent: -852.746827 hartree
zpe.sumelectthermalfe: -852.830387 hartree
dipole: 0.6927 2.2990 -0.7368
dipole: 2.5116
quadrupole: -120.4685 -115.1323 -127.0180
quadrupole: 21.3802 -8.3148 -6.0548
quadrupole: 0.4044 5.7406 -6.1451 21.3802 -8.3148 -6.0548
hfenergy: -853.2113082 hartree
pointgroup: C01 [X(C18H30O2)]
dipole: 0.2711887 0.6262024 -0.7146559 debye
polarizability: 277.6395194|-17.1318565|171.3172325|-17.732485|-15.3161583|168.8707797 unknown
InChI: InChI=1S/C18H30O2/c1-2-3-4-5-6-7-8-9-10-11-12-16-13-14-17(19)15-18(16)20/h13-15,19-20H,2-12H2,1H3
charge 0 multiplicity 1
50 atoms
O  4.413037 1.986524 -0.967055
O  8.211845 -1.169346 -0.979806
C  -3.219237 0.010673 -0.239659
C  -2.010903 0.412742 0.635706
C  -4.580735 0.245379 0.453233
C  -0.645349 0.110567 -0.022352
C  -5.792381 -0.14615 -0.422337
C  0.558185 0.527447 0.852834
C  -7.150586 0.050352 0.288697
C  1.922555 0.140361 0.241327
C  -8.364379 -0.334323 -0.586963
C  3.118923 0.574983 1.133322
C  -9.720633 -0.15581 0.133279
C  4.464785 0.140541 0.581782
C  -10.928629 -0.536516 -0.749912
C  5.090474 0.848306 -0.478115
C  5.144584 -0.999008 1.076624
C  6.333272 0.442548 -1.019997
C  6.383114 -1.434045 0.559435
C  6.974336 -0.704271 -0.493572
H  -3.188393 0.579108 -1.19277
H  -3.13047 -1.061339 -0.515011
H  -2.073541 1.495522 0.873047
H  -2.070814 -0.121215 1.607491
H  -4.666891 1.314136 0.74155
H  -4.611383 -0.334186 1.399835
H  -0.584322 0.628424 -1.002234
H  -0.579481 -0.975972 -0.241021
H  -5.777812 0.451805 -1.357717
H  -5.692289 -1.207801 -0.731755
H  0.528369 1.624445 1.020885
H  0.459722 0.057235 1.85459
H  -7.16533 -0.553981 1.22013
H  -7.248814 1.110004 0.60554
H  2.033862 0.606979 -0.756628
H  1.962928 -0.957288 0.088431
H  -8.359014 0.278598 -1.512851
H  -8.26143 -1.390382 -0.914158
H  2.984249 0.146671 2.146174
H  3.091738 1.676644 1.235818
H  -9.726117 -0.772598 1.05533
H  -9.820644 0.898079 0.464816
H  -10.966165 0.090134 -1.66116
H  -10.865334 -1.592896 -1.073252
H  -11.884557 -0.405145 -0.209928
H  4.686168 -1.560854 1.899058
H  6.794239 1.011825 -1.840524
H  6.896587 -2.314557 0.95421
H  4.940352 2.433773 -1.674192
H  8.545306 -0.592525 -1.710777
