program: Gaussian 09
title: 000090407
version: EM64L-G09RevD.01
frameworkgroup: C1[X(C9H11NO3)]
method: RPBEPBE
basis: SDD
operation: Freq
keyword: #p
keyword: freq=noraman
keyword: PBEPBE/SDD
title: #p freq=noraman PBEPBE/SDD
converged: YES YES NO NO
title: Mulliken charges:
elementType: O O O N C C C C C C C C C H H H H H H H H H H H
charge: -0.407079 -0.443659 -0.238060 -0.390160 -0.361378 0.168239 0.158860 0.151649 -0.310088 -0.350668 -0.387287 -0.250752 -0.196243 0.224636 0.240388 0.319318 0.221157 0.231563 0.240561 0.222129 0.233595 0.231856 0.332649 0.358776
chargesum: 0.00000
title: Mulliken charges with hydrogens summed into heavy atoms:
elementType: O O O N C C C C C C C C C
charge: -0.048303 -0.111011 -0.238060 -0.070842 0.103646 0.168239 0.158860 0.151649 0.142632 -0.110107 -0.165158 -0.017157 0.035613
polarizability: 1.50203958e+02 -6.47906693e+00 1.21986045e+02 -1.57139415e-01 -1.67160710e+00 6.58156473e+01
1716.lowfreq: -8.0207 -0.0007 0.0005 0.0007 5.4203 8.6749 26.5455 48.2542 64.2956
frequency: 26.1732 48.2332 64.2751 84.0619 133.8226 166.1189 204.7181 245.5569 281.9320 318.0733 344.5663 353.1780 374.4384 427.7243 478.1436 522.4843 531.5257 563.8014 573.7009 646.6970 704.5450 751.5638 756.1510 772.7719 814.9838 844.5986 859.0046 879.5497 935.8323 974.5129 996.3136 1025.6306 1040.7773 1076.6626 1088.4271 1149.9013 1154.6456 1172.4650 1174.6061 1250.9557 1251.6829 1273.0103 1288.8827 1328.6926 1355.1846 1372.9353 1388.7238 1422.4370 1429.0901 1464.3118 1470.0218 1491.6410 1590.8090 1608.4790 1614.5983 2996.6132 3007.6300 3079.0029 3091.7620 3115.3844 3128.0775 3146.2284 3169.4079 3552.3216 3554.9521 3577.3921
redmass: 5.2518 5.6682 6.3409 3.6540 3.0495 4.7224 4.6096 4.9057 4.6096 1.3570 1.1446 2.3898 3.4026 3.8788 3.1521 2.9368 4.0786 3.4010 1.3166 5.6729 4.7252 3.1536 1.5210 4.0661 4.1231 1.5589 2.7284 2.5990 1.3825 1.3243 2.4596 3.7544 2.1937 2.0112 2.1825 2.3276 1.3492 1.1164 1.1948 1.7459 2.4055 1.6198 1.4366 1.1636 1.3267 1.2134 7.6025 1.2265 2.1683 1.7094 1.0845 2.6736 6.5793 6.7960 7.3549 1.0646 1.0602 1.1015 1.1027 1.0886 1.0884 1.0925 1.1003 1.0662 1.0779 1.0661
irintensity: 0.3715 3.8724 6.7373 1.7097 9.3607 0.1251 2.5127 21.2324 3.9029 93.6689 132.0002 68.5486 43.6536 12.1104 7.4584 8.5018 3.2745 6.9216 45.1801 10.0279 17.4661 17.6725 79.8443 11.1177 17.4110 2.1141 16.6568 24.5207 1.5113 0.2217 58.0765 44.5219 15.7431 51.2830 34.9341 10.3510 81.8970 12.3764 21.0589 27.7869 37.2467 66.7844 54.1348 20.9102 6.3222 21.7894 12.5893 32.2762 46.7020 207.2052 8.0787 38.1579 38.1151 23.4316 157.9995 32.1707 28.8594 14.0948 42.2474 13.5812 4.9634 18.5776 19.1624 0.4449 21.5554 36.9178
temp: 298.150 k
press: 1.00000 atm
elementType: 8 8 8 7 6 6 6 6 6 6 6 6 6 1 1 1 1 1 1 1 1 1 1 1
symmnumber: 1
zpe: 493952.4 jmol-1
zpe.correction: 0.188137 hartree
zpe.thermalcorrener: 0.201018 hartree
zpe.thermalcorrenthalpy: 0.201962 hartree
zpe.thermalcorrgfe: 0.147501 hartree
zpe.sumelectzpe: -629.001700 hartree
zpe.sumelectthermal: -628.988819 hartree
zpe.sumelectthermalent: -628.987875 hartree
zpe.sumelectthermalfe: -629.042336 hartree
dipole: -3.8333 1.0339 -2.6751
dipole: 4.7874
quadrupole: -69.2001 -73.7562 -79.8482
quadrupole: -1.7858 -1.2217 4.1437
quadrupole: 5.0680 0.5120 -5.5800 -1.7858 -1.2217 4.1437
hfenergy: -629.1898366 hartree
pointgroup: C01 [X(C9H11N1O3)]
dipole: -1.5132559 -0.4480637 1.0280585 debye
dipolederiv: -0.0442805 -0.0651382 -0.0110524 0.0603201 -1.3018389 -0.1514823 0.0034334 -0.186147 -0.4073519 -0.2254006 0.0867346 0.1131152 0.2099972 -0.7590929 -0.0546344 0.1353851 -0.0384448 -0.5688925 -0.7220267 -0.1929055 0.0601356 -0.0352404 -0.6262415 0.3176265 -0.1887737 0.2615016 -0.6547402 -1.082696 0.1569319 -0.2515392 0.2580941 -0.5132645 0.0788256 -0.3279634 0.0248697 -0.5681256 0.528215 0.0759297 0.048101 0.1556207 0.1356969 0.0590292 0.073903 -0.0367177 0.1482736 -0.2638356 0.1025632 0.0225208 -0.2087226 -0.2692374 0.0137828 -0.0475738 -0.0032491 -0.1043055 1.5283218 0.0983145 0.2774617 -0.0663963 0.654447 -0.554997 0.5922521 -0.4506849 0.8692883 0.0626117 0.0693802 0.0024932 -0.1386443 1.2373292 0.2032192 0.0275438 0.2070015 0.1098473 0.2221532 -0.0134793 -0.0348981 -0.1193154 0.6034655 -0.0616984 -0.0648252 0.0265879 0.2894369 0.100981 -0.0160338 -0.0291877 0.1797955 0.120798 0.040328 -0.0985729 0.0224874 -0.1206841 -0.0050853 -0.316572 -0.0677629 0.0481218 -0.2688199 -0.0146959 -0.018828 -0.0064367 -0.1932377 -0.3121526 0.0048435 0.0004321 0.0307238 0.013342 0.0195543 0.0172274 0.0250586 -0.1816138 0.1540716 0.0376925 -0.0123291 -0.1482977 0.1295168 0.0403843 -0.0343292 0.0357705 -0.121288 -0.0297176 -0.0017894 -0.0349337 0.0088125 0.1126092 0.0614715 -0.0706921 0.006913 -0.1159585 0.0270213 0.0573383 0.0008444 -0.0558231 -0.0952186 -0.0256269 0.0450829 0.0275496 0.1039888 0.1423669 -0.042894 0.0014454 -0.100849 0.2075867 0.0677467 0.0235993 0.0809709 0.194283 -0.1664362 -0.088653 -0.0020994 -0.0348703 0.0073474 0.0055234 0.0000331 -0.0133056 0.107769 0.0772829 0.0452351 -0.0978362 0.0194784 -0.0291245 0.0344868 -0.0547565 0.041222 -0.117161 -0.0447864 0.1004083 0.0337691 0.0912148 0.0442745 -0.01662 0.0428624 -0.0114511 0.130954 -0.036747 0.0793291 0.025814 0.1156425 -0.022824 -0.0347982 0.0341326 -0.0373419 0.1643344 0.069814 -0.0172794 0.0046405 -0.039594 -0.1059536 -0.0346248 0.0068866 -0.0365301 0.1671687 -0.0869903 -0.0821185 0.0046793 -0.0753555 0.0574321 -0.0095244 0.0035368 -0.0041906 0.1565457 0.0589836 -0.138396 -0.0604026 -0.1364451 0.2747342 0.0163529 -0.0994734 0.0519812 0.3339797 0.0483316 0.0605584 0.006589 -0.0182675 0.3930362 0.0003711 -0.0000904 0.0125855 0.3774892 unknown
polarizability: 150.321283|6.1958735|121.8864464|0.585542|1.3218187|65.7979209 unknown
InChI: InChI=1S/C9H11NO3/c11-6-5-10-9(13)7-3-1-2-4-8(7)12/h1-4,10-12H,5-6H2
charge 0 multiplicity 1
24 atoms
O  -1.700654 2.144648 0.320248
O  4.019443 -1.531904 -0.112756
O  0.945719 1.491004 -1.029031
N  1.581148 0.060079 0.691735
C  2.966348 0.570092 0.72748
C  -0.733075 -0.025094 -0.078993
C  0.64133 0.594135 -0.189001
C  -1.893772 0.775445 0.105417
C  3.859759 -0.087889 -0.342013
C  -0.897095 -1.423322 -0.24007
C  -3.180545 0.184169 0.113682
C  -2.176958 -2.021699 -0.23439
C  -3.320129 -1.209492 -0.060691
H  3.38106 0.366193 1.730237
H  2.945164 1.663201 0.558153
H  1.253344 -0.553459 1.439444
H  4.880041 0.325032 -0.279657
H  3.448302 0.118873 -1.349526
H  -0.008958 -2.044517 -0.405036
H  -4.069179 0.811597 0.261967
H  -2.280426 -3.102255 -0.373856
H  -4.319971 -1.656615 -0.058265
H  3.130803 -1.957381 -0.221753
H  -2.566099 2.620761 0.380875
