program: Gaussian 09
title: 000090430
version: EM64L-G09RevD.01
frameworkgroup: C1[X(C12H10Cl4O4)]
method: RPBEPBE
basis: SDD
operation: Freq
keyword: #p
keyword: freq=noraman
keyword: PBEPBE/SDD
title: #p freq=noraman PBEPBE/SDD
converged: YES YES NO NO
title: Mulliken charges:
elementType: Cl Cl Cl Cl O O O O C C C C C C C C C C C C H H H H H H H H H H
charge: 0.059592 0.049914 0.070077 0.070901 -0.265196 -0.187012 -0.381786 -0.212379 -0.368064 -0.345404 -0.247001 0.359787 -0.685787 0.413281 0.150973 -0.373252 -0.308910 -0.095065 -0.093111 0.071052 0.212377 0.200930 0.199929 0.199616 0.238149 0.231299 0.210687 0.213506 0.221689 0.389207
chargesum: 0.00000
title: Mulliken charges with hydrogens summed into heavy atoms:
elementType: Cl Cl Cl Cl O O O O C C C C C C C C C C C C
charge: 0.059592 0.049914 0.070077 0.070901 -0.265196 -0.187012 0.007421 -0.212379 0.045244 0.054141 0.222448 0.359787 -0.039906 0.413281 0.150973 -0.373252 -0.308910 -0.095065 -0.093111 0.071052
polarizability: 2.48406152e+02 -3.07451786e+00 2.10575086e+02 -1.95639117e+01 -4.28585318e+00 1.09461947e+02
1716.lowfreq: -13.1424 -5.2903 -0.0010 0.0022 0.0026 2.7663 7.4394 21.4272 28.3540
frequency: -6.5273 19.9093 28.2997 42.6672 54.4380 64.8209 80.2085 84.9295 106.3660 112.5988 126.8705 158.8023 177.3085 206.4764 209.4284 215.6051 219.2707 232.5372 241.1559 255.6442 281.1462 289.7926 326.6900 340.4163 358.7517 405.0440 409.6216 431.4118 528.2860 546.2556 587.8802 608.1937 628.8902 654.1789 675.2486 706.5733 736.5253 759.8578 770.9286 794.0451 807.0911 843.0699 861.1029 906.8038 912.5823 928.5594 1025.3074 1039.5758 1076.8358 1085.5916 1124.5492 1145.0198 1156.8773 1211.2051 1216.4125 1268.4380 1271.0985 1284.6679 1289.4319 1335.2662 1339.4808 1343.3281 1367.8722 1386.8265 1392.5432 1465.3042 1470.4546 1477.9627 1479.3674 1488.7832 1525.3636 1551.8124 1636.9739 1643.5278 2971.2749 2977.3072 2991.4594 3006.1238 3014.8994 3047.2115 3072.6173 3079.3016 3082.5925 3511.4861
redmass: 2.3842 2.7359 5.8298 7.5038 12.0998 11.4420 20.7916 4.7033 2.2152 5.3336 7.0264 8.9281 7.8167 9.1846 11.7349 7.1324 18.5507 2.0781 1.8285 10.7894 14.0010 16.4755 21.0933 11.6857 11.7144 6.5585 3.6506 5.9445 3.2484 6.4742 3.0979 6.9279 3.2038 10.3904 8.2587 9.2368 1.0722 10.2949 10.5572 1.1626 11.0063 9.7726 9.2559 2.3264 4.9673 1.1656 6.1152 3.3165 2.9644 2.9031 2.6370 1.4888 4.3839 1.3540 7.8302 1.2730 1.1871 1.0968 2.9391 4.5202 8.3625 1.7984 1.7351 5.4226 1.2415 1.0851 1.0706 1.0525 1.0534 1.0867 11.9563 11.9890 11.9883 10.1537 1.0588 1.0366 1.0598 1.0567 1.1002 1.1035 1.1024 1.0994 1.1072 1.0641
irintensity: 0.1165 0.2394 0.1212 0.4102 0.7862 0.3855 0.3308 2.1024 0.6612 0.1432 0.9569 0.3824 1.3957 0.9469 0.4232 1.3881 0.1441 3.5312 2.7011 0.2794 3.4851 1.9565 0.4922 0.3158 0.1118 1.4848 8.8152 4.4342 14.4208 57.0594 59.6411 71.5366 51.3968 25.8209 20.6655 9.9076 8.9432 9.8046 3.5800 0.6830 1.0715 18.1537 5.0115 19.3994 21.8584 0.3482 54.6024 18.1006 294.8706 186.3641 3.6333 5.9507 151.2586 0.0734 332.2449 9.1164 2.5732 3.8856 98.9993 68.3080 3.9679 12.7899 19.2795 29.3977 14.5435 0.7294 0.5732 8.6005 10.4411 18.2643 32.2374 21.9919 98.0143 307.2798 25.5277 30.5085 22.0107 27.5745 5.1620 5.5916 24.4476 48.3217 80.6944 40.3465
temp: 298.150 k
press: 1.00000 atm
elementType: 17 17 17 17 8 8 8 8 6 6 6 6 6 6 6 6 6 6 6 6 1 1 1 1 1 1 1 1 1 1
symmnumber: 1
zpe: 517925.8 jmol-1
zpe.correction: 0.197268 hartree
zpe.thermalcorrener: 0.218069 hartree
zpe.thermalcorrenthalpy: 0.219013 hartree
zpe.thermalcorrgfe: 0.144558 hartree
zpe.sumelectzpe: -2602.916419 hartree
zpe.sumelectthermal: -2602.895618 hartree
zpe.sumelectthermalent: -2602.894673 hartree
zpe.sumelectthermalfe: -2602.969128 hartree
dipole: -2.9072 1.6774 -2.1852
dipole: 4.0051
quadrupole: -125.7619 -140.3088 -152.5500
quadrupole: -3.3776 4.6524 3.1054
quadrupole: 13.7783 -0.7685 -13.0098 -3.3776 4.6524 3.1054
hfenergy: -2603.1136862 hartree
pointgroup: C01 [X(C12H10Cl4O4)]
dipole: 1.108558 -0.3630106 -1.0593723 debye
polarizability: 246.1600697|-15.60906|193.4784839|19.6437909|38.5496918|128.8046315 unknown
InChI: InChI=1S/C12H10Cl4O4/c1-2-3-4-20-12(19)6-5(11(17)18)7(13)9(15)10(16)8(6)14/h17H,2-4H2,1H3
charge 0 multiplicity 1
30 atoms
Cl -1.093616 3.169758 1.312402
Cl -2.760728 -2.500329 -1.200402
Cl -4.0821 2.687539 0.273317
Cl -4.912609 -0.14162 -0.987578
O  1.751266 0.440184 0.088904
O  1.085651 1.08756 2.231152
O  0.312784 -2.194649 -1.478277
O  0.688391 -2.282368 0.813021
C  4.037798 0.117527 -0.686237
C  5.546037 0.113566 -0.337508
C  3.183243 0.453185 0.534127
C  -0.583306 0.542819 0.516876
C  6.426616 -0.24082 -1.554769
C  -0.93929 -0.692621 -0.091323
C  0.81102 0.731692 1.067699
C  -1.549332 1.569346 0.622839
C  -2.264286 -0.897238 -0.537355
C  -2.868084 1.371222 0.15042
C  -3.231182 0.128237 -0.420666
C  0.091051 -1.79184 -0.168252
H  3.839288 0.854472 -1.487696
H  3.743232 -0.874803 -1.079032
H  5.735131 -0.611408 0.479821
H  5.837587 1.109366 0.053165
H  3.289216 -0.290632 1.345297
H  3.406597 1.455325 0.943792
H  6.179812 -1.24642 -1.943676
H  6.277938 0.483753 -2.377031
H  7.498997 -0.235354 -1.288715
H  0.971178 -2.94205 -1.490517
