program: Gaussian 09
title: 000090426
version: EM64L-G09RevD.01
frameworkgroup: C1[X(C13H11Cl2NO3)]
method: RPBEPBE
basis: SDD
operation: Freq
keyword: #p
keyword: freq=noraman
keyword: PBEPBE/SDD
title: #p freq=noraman PBEPBE/SDD
converged: NO NO NO NO
title: Mulliken charges:
elementType: Cl Cl O O O N C C C C C C C C C C C C C H H H H H H H H H H H
charge: -0.026807 -0.026837 -0.206187 -0.275251 -0.257079 -0.006226 -0.072796 0.052849 0.595718 0.306001 0.185504 -0.293735 -0.293752 -0.758871 -0.245206 -0.245213 -0.213524 -0.221425 -0.668826 0.245987 0.261809 0.261837 0.263148 0.263149 0.242169 0.230575 0.230576 0.211537 0.230434 0.230440
chargesum: 0.00000
title: Mulliken charges with hydrogens summed into heavy atoms:
elementType: Cl Cl O O O N C C C C C C C C C C C C C
charge: -0.026807 -0.026837 -0.206187 -0.275251 -0.257079 -0.006226 -0.072796 0.052849 0.595718 0.306001 0.185504 -0.293735 -0.293752 0.010762 0.017942 0.017936 0.028645 0.239726 0.003585
polarizability: 2.14765133e+02 -1.16968435e+01 1.40610261e+02 2.31285086e-02 7.48569194e-02 1.57899672e+02
1716.lowfreq: -32.9578 -0.0020 -0.0016 -0.0016 4.3717 7.4385 8.1585 17.6393 26.6702
frequency: -32.8371 17.5863 26.5029 48.4026 52.6886 67.6019 73.7774 105.8202 122.6748 150.4165 160.8299 195.6668 205.8447 229.8753 267.4185 272.3296 276.2426 320.0520 328.2299 372.2437 386.8761 398.4671 434.5502 482.3784 486.5188 524.1428 567.8853 608.2781 663.2034 680.2419 724.5548 740.1183 740.3028 768.2323 778.8862 783.4607 799.6715 820.9445 834.6182 896.5333 935.3071 957.7373 972.8169 1018.1872 1036.6027 1053.8197 1063.3747 1068.2446 1112.1617 1136.8911 1153.5452 1154.6845 1193.1436 1216.3126 1250.6003 1275.3600 1354.3173 1355.3454 1379.8111 1390.8130 1400.1477 1406.7360 1414.8138 1444.6853 1458.3594 1462.0083 1473.2468 1485.5754 1489.4020 1560.8157 1584.0309 1599.7980 1611.1894 2992.8838 3001.1554 3003.6581 3061.2030 3083.0316 3089.3437 3105.0048 3119.4535 3149.2908 3171.9427 3182.2429
redmass: 1.0204 6.9843 3.6218 4.6883 4.0905 8.7717 5.5200 2.9938 6.2026 4.5773 11.2901 4.6390 4.3685 1.4771 4.9448 3.3867 9.0970 7.0863 6.4117 3.6675 8.5290 7.3969 9.2305 8.7178 4.8261 5.3499 4.2758 6.2478 6.3751 10.4583 5.5084 9.1773 3.5952 8.1290 5.4757 1.7675 1.1110 8.8226 4.3180 1.3593 3.0101 4.6040 1.3299 2.2406 1.5012 3.6820 4.5752 4.0867 2.2100 1.4673 3.1475 1.4397 1.4132 4.4721 1.1308 5.2010 1.6063 10.4152 4.1326 2.4833 1.3084 1.4464 2.2143 1.0435 1.1138 1.0402 1.0565 1.2471 3.3353 6.9382 10.2111 9.0740 11.4392 1.0358 1.0364 1.0581 1.1067 1.0965 1.0986 1.1024 1.1012 1.0877 1.0931 1.0994
irintensity: 0.2129 0.1694 0.0046 0.3895 0.2912 1.1613 3.2148 0.0136 1.2899 4.4171 0.6773 0.0032 6.5858 0.0011 4.7381 2.9863 1.1930 0.4485 3.6257 5.8807 5.9475 3.2216 5.0709 1.0847 2.4557 0.1879 2.9203 0.4708 6.1362 0.9249 3.6548 84.3267 15.2653 0.0150 19.6080 41.5453 3.2310 15.5846 2.1807 0.0009 14.1500 27.0459 0.8071 6.1226 5.6065 33.7050 263.0308 9.7971 3.7351 5.4064 48.3905 7.6003 13.5395 26.0928 0.0010 158.8542 6.7625 4.1258 3.9760 25.3860 7.2256 40.3371 66.7998 18.8574 13.4176 15.2724 8.9996 14.7633 7.0502 49.2181 194.0139 15.8864 238.1583 16.6722 2.7527 20.2344 7.7601 2.6397 32.4245 34.2678 8.9101 5.1806 0.6106 5.5622
temp: 298.150 k
press: 1.00000 atm
elementType: 17 17 8 8 8 7 6 6 6 6 6 6 6 6 6 6 6 6 6 1 1 1 1 1 1 1 1 1 1 1
symmnumber: 1
zpe: 555325.4 jmol-1
zpe.correction: 0.211512 hartree
zpe.thermalcorrener: 0.229726 hartree
zpe.thermalcorrenthalpy: 0.230670 hartree
zpe.thermalcorrgfe: 0.162349 hartree
zpe.sumelectzpe: -1701.120107 hartree
zpe.sumelectthermal: -1701.101894 hartree
zpe.sumelectthermalent: -1701.100950 hartree
zpe.sumelectthermalfe: -1701.169271 hartree
dipole: -2.6498 3.3061 -0.0054
dipole: 4.2369
quadrupole: -102.4583 -129.5662 -123.5646
quadrupole: -4.4273 0.0032 0.0115
quadrupole: 16.0714 -11.0365 -5.0349 -4.4273 0.0032 0.0115
hfenergy: -1701.3316194 hartree
pointgroup: C01 [X(C13H11Cl2N1O3)]
dipole: -1.1108455 1.2428648 -0.0009543 debye
polarizability: 215.8058149|-7.6525649|139.5694759|0.0028977|0.0632878|157.8997751 unknown
InChI: InChI=1S/C13H11Cl2NO3/c1-3-18-13(17)10-7(2)19-16-12(10)11-8(14)5-4-6-9(11)15/h4-6H,3H2,1-2H3
charge 0 multiplicity 1
30 atoms
Cl -0.75209 -0.892199 -2.79152
Cl -0.750627 -0.883987 2.793099
O  2.586566 -2.035491 0.001304
O  0.123478 1.860209 -0.002158
O  2.42242 2.28066 -0.002329
N  1.136564 -2.27996 0.001687
C  1.598929 0.002431 -0.00059
C  0.591101 -1.040597 0.000649
C  -0.8912 -0.913081 0.000864
C  2.826614 -0.663604 -0.000041
C  1.460359 1.467121 -0.002019
C  -1.636832 -0.8491 -1.202209
C  -1.636209 -0.845503 1.204128
C  4.248822 -0.217801 -0.000619
C  -3.039625 -0.7361 -1.225059
C  -3.038966 -0.732297 1.227381
C  -3.737813 -0.681329 0.001266
C  -0.128421 3.331381 -0.002886
C  -1.642904 3.516758 -0.003073
H  4.922237 -1.089887 0.000326
H  4.455409 0.411834 -0.883773
H  4.455471 0.413849 0.881074
H  -3.569461 -0.69556 -2.18054
H  -3.568301 -0.688834 2.183014
H  -4.829552 -0.599432 0.001428
H  0.354182 3.767999 0.891148
H  0.354302 3.767156 -0.897267
H  -1.885833 4.595487 -0.003573
H  -2.094846 3.056596 -0.898574
H  -2.094975 3.057381 0.892761
