program: Gaussian 09
title: 000090408
version: EM64L-G09RevD.01
frameworkgroup: C1[X(C9H11NO4)]
method: RPBEPBE
basis: SDD
operation: Freq
keyword: #p
keyword: freq=noraman
keyword: PBEPBE/SDD
title: #p freq=noraman PBEPBE/SDD
converged: YES YES NO NO
title: Mulliken charges:
elementType: O O O O N C C C C C C C C C H H H H H H H H H H H
charge: -0.409960 -0.448813 -0.377390 -0.424205 -0.403843 0.134704 -0.351745 0.252776 0.187927 -0.285786 -0.318890 -0.527299 -0.407477 0.343319 0.226238 0.241176 0.315414 0.195081 0.225724 0.234217 0.252596 0.256349 0.386996 0.340507 0.362384
chargesum: 0.00000
title: Mulliken charges with hydrogens summed into heavy atoms:
elementType: O O O O N C C C C C C C C C
charge: -0.022963 -0.108307 -0.377390 -0.061822 -0.088429 0.134704 0.115670 0.252776 0.187927 -0.090705 0.141051 -0.274703 -0.151128 0.343319
polarizability: 1.88178174e+02 -7.37174195e+00 1.22660915e+02 1.38992760e+01 6.89137638e+00 6.45108996e+01
1716.lowfreq: -10.3373 -3.3277 -0.0010 -0.0004 -0.0003 6.9381 32.2587 45.5359 65.3072
frequency: 31.9734 45.2776 65.2874 102.3398 125.4355 171.1176 221.9433 236.1225 277.4842 297.2855 327.6968 346.3734 379.9024 403.9775 420.8951 426.4039 490.7893 514.6664 543.4343 574.6570 605.7341 619.2189 669.5199 730.3083 741.7851 784.3356 795.7734 838.8086 857.4879 873.0526 924.0526 957.7258 960.5067 993.6838 1031.2166 1072.7607 1117.2574 1135.3887 1157.5389 1174.0896 1184.6645 1235.3695 1259.4320 1305.4961 1328.0632 1330.0461 1345.0138 1351.6781 1370.1267 1416.2342 1419.3594 1439.4587 1466.4430 1487.9140 1519.9056 1573.9648 1596.6962 1650.5778 2701.7814 3001.2726 3016.4855 3083.6611 3093.0374 3117.9767 3148.5074 3183.9757 3566.8177 3579.7093 3585.4865
redmass: 5.1312 6.0845 4.9126 3.2177 5.0460 3.6085 5.6082 4.6515 1.1774 5.4804 3.9776 4.1437 4.0671 1.1257 6.6688 2.4027 2.9306 2.8524 1.5301 5.0547 5.9599 5.6258 3.3838 7.5174 2.9114 3.3231 1.8385 1.7571 2.8035 2.5293 1.3547 3.3560 1.0637 2.5387 3.7822 1.9814 2.0978 1.5631 2.1364 1.2524 1.5342 1.6849 1.3021 2.5121 1.4777 1.5529 2.0965 1.3864 1.2374 3.1661 2.1762 1.4916 1.0862 2.5563 2.6428 3.6397 4.5771 4.1222 1.0719 1.0634 1.0593 1.1019 1.1050 1.0891 1.0923 1.0950 1.0662 1.0660 1.0774
irintensity: 0.2590 2.8680 8.5776 3.2152 1.4443 10.2388 2.1714 10.0765 196.6007 3.5732 12.0940 15.8692 13.6751 152.7650 6.1185 4.2827 11.3731 33.0377 46.8257 9.3274 17.9727 0.7064 22.0393 0.1497 4.6134 9.7449 15.5993 64.5715 27.2073 13.1754 0.4421 24.3786 143.2051 75.5303 22.6921 4.1505 12.2945 353.7239 44.5298 35.8878 8.8422 9.1999 5.3965 249.6141 42.3748 54.7642 81.2311 29.3828 11.8616 91.1940 10.7862 17.5461 7.6541 175.3064 363.0216 103.1797 120.4863 304.5411 505.8854 29.4931 29.6771 16.7379 37.1693 19.8947 4.7555 3.1125 4.3113 61.6129 22.2777
temp: 298.150 k
press: 1.00000 atm
elementType: 8 8 8 8 7 6 6 6 6 6 6 6 6 6 1 1 1 1 1 1 1 1 1 1 1
symmnumber: 1
zpe: 504838.8 jmol-1
zpe.correction: 0.192283 hartree
zpe.thermalcorrener: 0.205790 hartree
zpe.thermalcorrenthalpy: 0.206735 hartree
zpe.thermalcorrgfe: 0.151203 hartree
zpe.sumelectzpe: -704.169169 hartree
zpe.sumelectthermal: -704.155662 hartree
zpe.sumelectthermalent: -704.154717 hartree
zpe.sumelectthermalfe: -704.210249 hartree
dipole: 0.9783 -2.0203 -1.0086
dipole: 2.4609
quadrupole: -78.6013 -87.6798 -83.1755
quadrupole: 1.4294 8.7470 3.0337
quadrupole: 4.5509 -4.5276 -0.0233 1.4294 8.7470 3.0337
hfenergy: -704.361452 hartree
pointgroup: C01 [X(C9H11N1O4)]
dipole: 0.4023715 -0.7855257 -0.3980506 debye
dipolederiv: -0.686746 0.2460251 0.0132041 0.1855586 -1.1417367 -0.0913928 -0.0101309 -0.093665 -0.4080065 -0.2313268 0.0615771 0.1387011 -0.0462412 -0.6393766 0.160915 0.2669909 0.1301057 -0.7184999 -0.9362329 0.1445997 -0.0371532 0.0458443 -0.9856317 -0.0515467 -0.0535832 -0.0708328 -0.3929081 -1.650473 0.2998322 -0.1146463 0.2563323 -0.1523269 0.0816993 -0.1407811 0.0912139 -0.4246463 -1.3179366 -0.2716584 -0.0533837 -0.6969295 -0.5394169 -0.0691317 -0.1217758 -0.0252316 -0.5129453 -1.1368849 -0.062533 -0.1331343 0.4274342 -0.424058 -0.0020236 -0.0819616 -0.0671835 -0.1128982 0.6830673 0.0028111 0.0702082 -0.0623086 0.1282296 -0.0314438 0.1485902 0.0742559 0.1386639 2.1854977 0.0775341 0.2093837 0.3792871 1.0955973 0.1261965 0.3065215 0.137269 0.2864289 0.6459975 -0.3741039 0.0063074 -0.1117553 1.045028 0.1292882 0.0589268 0.1032412 0.1556408 0.5309301 -0.1062312 0.069458 -0.4682045 0.1929694 -0.0039398 0.0138813 0.0375611 -0.0894806 0.2123683 -0.0451468 -0.0297437 0.0500511 0.4879521 -0.1465145 -0.1674762 -0.2320841 0.4407147 -0.4436378 0.3809077 0.040187 0.358256 -0.324032 0.0368238 0.0332313 0.0431339 -0.2341392 -0.796807 0.0251868 -0.0681574 -0.3081718 -0.0554898 -0.0147132 -0.1414186 0.0302781 -0.2244883 1.6696137 -0.2561922 0.1737619 0.0102828 0.4574683 0.0578901 0.2357122 0.021767 0.150141 -0.0425628 -0.0278891 -0.0201236 -0.0645646 -0.0070578 -0.1410581 -0.0466674 -0.0890414 0.0135215 0.0154804 -0.0353963 0.0267099 0.079819 -0.0175134 0.1167712 -0.0002129 0.0728158 0.0297771 0.1538863 0.0458789 -0.0122576 0.0885208 0.1400838 -0.0201975 -0.0414559 -0.0181437 0.3022873 -0.0136734 -0.1255093 -0.0475449 -0.1073085 -0.0134146 -0.0412374 -0.0437808 -0.0440609 0.1234178 -0.1825098 0.0616861 -0.0430676 0.0185383 0.0558243 0.0394426 0.0059069 0.0571858 0.0670342 0.092036 -0.0894707 -0.0542591 -0.0446174 -0.0976073 -0.0440639 -0.0421683 -0.0429561 -0.0382093 -0.0178581 -0.057204 -0.0396625 -0.0690744 0.0317155 -0.0373928 -0.0435076 -0.0355314 0.1765504 0.0671099 0.0494262 -0.0074604 0.0549542 -0.0254197 -0.0291594 -0.0079255 -0.0286754 0.1770609 0.7144263 0.0842876 0.0500925 0.075328 0.4393075 0.0151506 0.0654103 0.0252892 0.3621706 0.0546741 0.0232786 -0.1322185 0.0129396 0.2676425 0.0226969 -0.1882202 -0.0159595 0.3559743 0.4315613 -0.0516963 -0.0052012 -0.0639704 0.0812631 -0.0630591 -0.0041054 -0.060751 0.3768385 unknown
polarizability: 188.5839287|-5.7770097|122.349447|13.3103388|7.2306684|64.4166129 unknown
InChI: InChI=1S/C9H11NO4/c11-4-3-10-9(14)7-2-1-6(12)5-8(7)13/h1-2,5,10-13H,3-4H2
charge 0 multiplicity 1
25 atoms
O  0.922022 2.397208 0.33636
O  -4.200745 -1.407146 1.241373
O  -1.422935 1.633365 -0.150453
O  4.514012 -0.864756 0.307125
N  -1.96058 -0.565788 -0.60173
C  0.398747 0.042121 -0.151587
C  -3.384993 -0.234234 -0.805405
C  -1.028386 0.402163 -0.30157
C  1.329493 1.096046 0.171513
C  0.912302 -1.278095 -0.306581
C  -4.165711 -0.12651 0.519638
C  2.707255 0.808044 0.328774
C  2.272341 -1.569407 -0.153522
C  3.167522 -0.511448 0.166793
H  -3.830887 -1.028692 -1.429003
H  -3.451218 0.729245 -1.342693
H  -1.658363 -1.526299 -0.756994
H  0.242949 -2.111195 -0.554573
H  -5.220479 0.110772 0.303064
H  -3.736421 0.682043 1.14239
H  3.381201 1.636374 0.573998
H  2.66536 -2.581761 -0.273004
H  -0.107881 2.406052 0.178533
H  -3.308606 -1.570029 1.639285
H  5.069701 -0.075573 0.52627
