program: Gaussian 09
title: 000090405
version: EM64L-G09RevD.01
frameworkgroup: C1[X(C12H17NO)]
method: RPBEPBE
basis: SDD
operation: Freq
keyword: #p
keyword: freq=noraman
keyword: PBEPBE/SDD
title: #p freq=noraman PBEPBE/SDD
converged: YES YES NO NO
title: Mulliken charges:
elementType: O N C C C C C C C C C C C C H H H H H H H H H H H H H H H H H
charge: -0.233321 -0.340345 0.289237 -0.573315 -0.741690 -0.753622 0.140851 -0.651768 0.284270 -0.343072 -0.352949 -0.247776 -0.230276 -0.225383 0.262983 0.236284 0.201473 0.266060 0.205598 0.261008 0.222796 0.196393 0.259454 0.203696 0.219320 0.220583 0.250325 0.277961 0.229778 0.232634 0.232813
chargesum: 0.00000
title: Mulliken charges with hydrogens summed into heavy atoms:
elementType: O N C C C C C C C C C C C C
charge: -0.233321 -0.080892 0.289237 -0.074048 -0.068559 -0.073424 0.140851 -0.008169 0.284270 -0.092748 -0.074988 -0.017998 0.002358 0.007430
polarizability: 1.92117299e+02 4.07894788e+00 1.41501147e+02 -1.05724224e+00 4.98917320e+00 8.70400000e+01
1716.lowfreq: -12.8263 -8.3855 -0.0002 0.0004 0.0008 5.2125 33.6209 38.2849 74.5842
frequency: 32.8921 38.1394 74.5572 110.3153 120.3642 153.0750 203.5654 217.5353 233.6647 248.1180 281.6462 298.2027 321.0509 342.1948 390.9356 400.7986 416.7392 436.5535 479.4052 482.6580 578.9034 594.4790 613.3254 653.6362 697.0691 748.3124 766.3756 800.6046 858.6612 877.1937 886.4845 927.1717 947.7774 950.2275 989.3981 991.1923 1008.1342 1012.5718 1016.4076 1029.9565 1076.5889 1085.1097 1098.8718 1121.9279 1141.4228 1169.7016 1175.9684 1188.2472 1232.5893 1247.3282 1278.5248 1312.3341 1330.5561 1364.4918 1382.2415 1386.2259 1423.7036 1434.9560 1437.2676 1446.7223 1457.8608 1469.3241 1476.5342 1477.0788 1483.7544 1499.2932 1502.7599 1569.2933 1597.3129 1612.1982 2897.9369 2960.9967 2972.1386 2976.2270 3012.8073 3015.7388 3061.3091 3064.8720 3066.9573 3094.3819 3114.3437 3127.4288 3137.5761 3149.3824 3158.4124 3168.6097 3442.7140
redmass: 3.9376 3.2729 2.6084 2.9150 2.7571 4.5486 2.8112 1.7479 1.5800 1.1599 1.2051 3.2059 3.1989 2.1338 2.5310 2.8134 3.4395 3.5330 2.7925 2.9650 2.7536 1.8042 6.4247 5.1063 1.8030 3.1156 1.6977 5.2622 1.2594 1.8342 1.9725 1.4139 2.2492 1.5931 6.2312 1.3780 1.3520 1.3860 2.6586 1.8426 1.4525 1.5895 1.9551 1.9126 1.6113 1.4439 1.4148 1.1701 3.0578 2.4143 2.0433 1.4530 1.8487 1.2209 1.2260 9.2402 1.1094 2.1046 1.1708 1.2050 1.0528 1.0518 1.0718 2.1332 1.0700 1.0604 1.0663 6.1979 6.5421 6.4959 1.0527 1.0600 1.0372 1.0385 1.0794 1.0948 1.0985 1.0979 1.0982 1.0987 1.0982 1.0850 1.0882 1.0925 1.0959 1.1012 1.0745
irintensity: 1.2341 0.1880 1.4723 3.0695 1.6681 0.0841 3.9544 0.7557 2.8417 0.7284 0.2329 10.6734 0.9082 3.7086 6.3397 0.0143 0.4224 3.4815 10.7711 19.8286 3.6519 107.6926 0.1847 22.4255 51.0798 8.0405 58.6555 15.6503 0.3239 3.9140 3.3606 0.4252 20.1559 3.6662 2.1781 0.5096 0.1517 1.5338 17.6913 2.6244 16.0123 7.1977 3.2448 15.0726 22.5702 42.4722 27.3958 6.3979 100.4468 6.0849 7.2435 26.0530 182.1277 35.0278 48.8557 1.8080 5.9797 22.4155 0.7948 10.5902 0.7087 3.2268 5.6347 0.6709 27.7398 19.1006 6.6882 76.2440 34.7748 10.8778 112.5407 48.0853 39.7304 29.4869 51.0409 11.5530 24.7711 22.7216 88.4947 10.2755 10.3987 0.1205 7.0910 17.3050 20.6042 22.8135 2.2558
temp: 298.150 k
press: 1.00000 atm
elementType: 8 7 6 6 6 6 6 6 6 6 6 6 6 6 1 1 1 1 1 1 1 1 1 1 1 1 1 1 1 1 1
symmnumber: 1
zpe: 688644.2 jmol-1
zpe.correction: 0.262291 hartree
zpe.thermalcorrener: 0.276944 hartree
zpe.thermalcorrenthalpy: 0.277888 hartree
zpe.thermalcorrgfe: 0.220426 hartree
zpe.sumelectzpe: -596.374098 hartree
zpe.sumelectthermal: -596.359445 hartree
zpe.sumelectthermalent: -596.358501 hartree
zpe.sumelectthermalfe: -596.415963 hartree
dipole: 0.5518 2.4610 -0.2158
dipole: 2.5313
quadrupole: -68.3795 -85.5863 -89.1300
quadrupole: 0.4363 0.6479 -1.4090
quadrupole: 12.6525 -4.5544 -8.0981 0.4363 0.6479 -1.4090
hfenergy: -596.6363887 hartree
pointgroup: C01 [X(C12H17N1O1)]
dipole: 0.2263832 -0.9462795 0.2123344 debye
polarizability: 192.1764156|-3.3368018|141.7819995|2.1910079|-2.2597196|86.7000312 unknown
InChI: InChI=1S/C12H17NO/c1-12(2,13-3)9-11(14)10-7-5-4-6-8-10/h4-8,13H,9H2,1-3H3
charge 0 multiplicity 1
31 atoms
O  -0.180761 1.973721 -0.076814
N  -3.41928 -1.013227 -0.444497
C  -2.56067 0.206996 -0.273282
C  -1.098341 -0.307576 -0.143344
C  -2.966397 1.072186 0.953896
C  -2.729576 1.028038 -1.575076
C  0.029923 0.72314 -0.094762
C  -3.617614 -1.919149 0.703635
C  1.448433 0.206746 -0.061629
C  1.767015 -1.178832 -0.081611
C  2.505385 1.156149 -0.004558
C  3.113167 -1.602326 -0.04547
C  3.848429 0.733481 0.031127
C  4.156471 -0.648843 0.01061
H  -0.919416 -0.999404 -0.991267
H  -1.007878 -0.931717 0.770919
H  -4.0236 1.387566 0.864178
H  -2.333365 1.97325 1.009833
H  -2.855515 0.512463 1.901542
H  -2.118524 1.943227 -1.539552
H  -2.433313 0.424899 -2.452549
H  -3.78918 1.324998 -1.704259
H  -4.315341 -0.753057 -0.878372
H  -4.060171 -1.44808 1.612518
H  -2.658148 -2.380967 1.002005
H  -4.285025 -2.74302 0.391944
H  0.971623 -1.929648 -0.126565
H  2.239972 2.218536 0.009975
H  3.349951 -2.671911 -0.062335
H  4.655077 1.473531 0.074497
H  5.200868 -0.97977 0.037864
