program: Gaussian 09
title: 000090410
version: EM64L-G09RevD.01
frameworkgroup: C1[X(C13H19NO)]
method: RPBEPBE
basis: SDD
operation: Freq
keyword: #p
keyword: freq=noraman
keyword: PBEPBE/SDD
title: #p freq=noraman PBEPBE/SDD
converged: YES YES NO NO
title: Mulliken charges:
elementType: O N C C C C C C C C C C C C C H H H H H H H H H H H H H H H H H H H
charge: -0.228198 -0.313950 0.298695 -0.576030 -0.753000 -0.746908 -0.335988 0.144467 0.282001 -0.695502 -0.343192 -0.350361 -0.246662 -0.229492 -0.225057 0.244778 0.223927 0.234722 0.232451 0.255297 0.187622 0.259826 0.197925 0.226120 0.220458 0.169668 0.199500 0.233652 0.210738 0.247549 0.278391 0.229829 0.233285 0.233439
chargesum: 0.00000
title: Mulliken charges with hydrogens summed into heavy atoms:
elementType: O N C C C C C C C C C C C C C
charge: -0.228198 -0.079228 0.298695 -0.107325 -0.077630 -0.063036 0.054137 0.144467 0.282001 -0.051612 -0.095643 -0.071970 -0.016833 0.003793 0.008382
polarizability: 2.02409429e+02 -5.22638387e+00 1.56256733e+02 1.27434976e+00 5.47497781e+00 9.70694672e+01
1716.lowfreq: 0.0001 0.0005 0.0006 2.2490 8.0019 10.2568 30.9646 40.1397 58.1270
frequency: 30.7446 40.1045 58.0952 69.6233 102.2862 134.8037 150.9078 189.7773 205.4518 229.6600 249.8913 255.5813 278.3658 308.9161 332.0655 342.9955 400.5807 410.0318 426.9500 441.1109 485.7152 504.9060 577.3779 589.9959 614.1931 656.4545 696.9618 759.2220 765.5953 796.7710 812.9227 858.2680 873.9808 890.1294 937.9687 943.6815 950.0192 973.3219 989.8370 990.8788 1009.6099 1012.6465 1016.1486 1029.5860 1073.5435 1085.0338 1116.1053 1118.1353 1169.1579 1170.9533 1176.4053 1188.0654 1214.8444 1243.2932 1254.0899 1290.2420 1309.2133 1329.3093 1349.4920 1374.3551 1386.6364 1387.0736 1387.7052 1422.5633 1435.5908 1449.4038 1463.9469 1470.2444 1476.5267 1478.1123 1482.1072 1482.6061 1496.4068 1499.7480 1569.7485 1598.0657 1612.2867 2841.6559 2948.6525 2971.9220 2976.6434 2985.2518 3000.6545 3021.3143 3068.2917 3069.7869 3076.9682 3092.4888 3112.0976 3117.9720 3127.7153 3137.9298 3150.1834 3158.9865 3168.9187 3418.5749
redmass: 3.8349 3.3883 2.5229 2.1108 3.3843 3.7301 4.6139 2.4272 4.2290 1.1124 1.2974 1.2556 1.8900 4.8541 2.0838 2.5806 2.8085 2.6850 3.1903 3.5269 3.4579 2.6577 2.6142 1.6757 6.3826 5.1058 1.8056 3.2214 1.7138 5.1477 1.1278 1.2587 1.8477 1.9181 1.6810 1.8830 1.4425 2.4386 5.6418 1.4105 1.3555 2.2033 1.4938 1.8884 2.3341 1.5937 2.1690 1.5614 1.8404 1.4285 1.3962 1.1579 2.7952 3.6597 1.2678 1.5732 1.4721 1.6029 1.3315 1.2469 1.3619 4.9905 1.2319 1.1084 2.2284 1.1788 1.0494 1.0518 1.1366 1.9108 1.0514 1.0925 1.0680 1.0824 6.4148 6.6293 6.5091 1.0720 1.0592 1.0415 1.0371 1.0382 1.0968 1.0849 1.0946 1.0969 1.0968 1.1003 1.0993 1.0990 1.0850 1.0881 1.0923 1.0956 1.1011 1.0739
irintensity: 0.2419 0.0108 0.3958 0.4896 2.2464 1.1178 0.2259 3.4598 4.2629 0.9732 1.3163 0.9128 0.9679 4.4452 1.3871 2.6709 0.0721 2.1714 5.1534 0.5603 2.4143 13.9236 14.0355 145.8095 0.8345 7.9660 49.3398 4.8321 57.9032 8.4289 4.1775 0.4417 8.6686 3.4028 2.6399 4.2533 1.9956 20.7256 2.3481 0.6485 1.0961 19.0681 7.5366 1.9905 1.5921 8.8626 12.8603 11.1467 99.4684 18.6205 62.3117 4.7744 4.4018 118.9962 1.4994 13.0302 34.9321 129.1441 5.0649 30.4586 37.0755 12.4281 21.1236 2.4106 22.4900 10.6959 0.7937 17.4965 8.0641 2.0553 19.1527 11.5704 6.6014 8.3416 78.9688 35.1690 10.4675 112.7160 40.2635 38.1585 40.2687 17.3695 15.1019 20.3644 5.6428 80.7346 50.1254 34.5312 3.2429 18.9360 0.1672 7.2618 17.3266 22.7908 21.2981 3.7548
temp: 298.150 k
press: 1.00000 atm
elementType: 8 7 6 6 6 6 6 6 6 6 6 6 6 6 6 1 1 1 1 1 1 1 1 1 1 1 1 1 1 1 1 1 1 1
symmnumber: 1
zpe: 762028.1 jmol-1
zpe.correction: 0.290241 hartree
zpe.thermalcorrener: 0.306302 hartree
zpe.thermalcorrenthalpy: 0.307246 hartree
zpe.thermalcorrgfe: 0.246204 hartree
zpe.sumelectzpe: -635.599442 hartree
zpe.sumelectthermal: -635.583381 hartree
zpe.sumelectthermalent: -635.582437 hartree
zpe.sumelectthermalfe: -635.643480 hartree
dipole: -1.4687 3.5292 0.5515
dipole: 3.8622
quadrupole: -84.2573 -92.0090 -92.9141
quadrupole: -0.0114 -0.0857 0.5734
quadrupole: 5.4695 -2.2822 -3.1873 -0.0114 -0.0857 0.5734
hfenergy: -635.8896831 hartree
pointgroup: C01 [X(C13H19N1O1)]
dipole: 0.625119 1.3839282 -0.0531204 debye
polarizability: 202.6276898|3.5018213|156.4488701|3.2816599|1.1799226|96.6590689 unknown
InChI: InChI=1S/C13H19NO/c1-4-14-13(2,3)10-12(15)11-8-6-5-7-9-11/h5-9,14H,4,10H2,1-3H3
charge 0 multiplicity 1
34 atoms
O  0.414107 -2.129533 -0.007519
N  -3.244746 0.35439 -0.504711
C  -2.171033 -0.676181 -0.34225
C  -0.771384 0.017206 -0.191606
C  -2.205691 -1.540994 -1.625616
C  -2.490375 -1.553858 0.892357
C  -3.485506 1.342429 0.566423
C  0.475903 -0.865191 -0.07089
C  1.822364 -0.18304 -0.024265
C  -4.665025 2.257414 0.187456
C  1.974601 1.229886 -0.063482
C  2.98401 -0.997768 0.071223
C  3.25922 1.812356 -0.008658
C  4.265889 -0.416711 0.125066
C  4.407416 0.991834 0.085198
H  -0.793892 0.679048 0.700162
H  -0.623433 0.69436 -1.060395
H  -3.186933 0.806486 -1.429093
H  -3.210058 -1.9839 -1.741599
H  -1.456768 -2.346449 -1.570919
H  -1.99539 -0.926958 -2.524618
H  -1.793971 -2.406197 0.937031
H  -2.396586 -0.987463 1.837908
H  -3.52641 -1.927799 0.814575
H  -3.733914 0.79861 1.496454
H  -2.596243 1.982538 0.800118
H  -4.446424 2.830124 -0.734982
H  -5.572181 1.654655 0.007294
H  -4.874695 2.984792 0.992574
H  1.096796 1.880271 -0.134219
H  2.847299 -2.083901 0.101647
H  3.366811 2.902223 -0.038373
H  5.153711 -1.054379 0.197818
H  5.40393 1.445704 0.127491
