program: Gaussian 09
title: 000090395
version: EM64L-G09RevD.01
frameworkgroup: C1[X(C10H13NO2)]
method: RPBEPBE
basis: SDD
operation: Freq
keyword: #p
keyword: freq=noraman
keyword: PBEPBE/SDD
title: #p freq=noraman PBEPBE/SDD
converged: YES YES NO NO
title: Mulliken charges:
elementType: O O N C C C C C C C C C C H H H H H H H H H H H H H
charge: -0.230356 -0.420563 -0.297207 -0.515443 -0.376295 0.113681 0.296959 -0.314162 -0.331075 -0.407677 -0.350497 0.295677 -0.625002 0.217007 0.256407 0.202123 0.230304 0.246584 0.247662 0.280909 0.223754 0.257607 0.192419 0.219276 0.228747 0.359161
chargesum: 0.00000
title: Mulliken charges with hydrogens summed into heavy atoms:
elementType: O O N C C C C C C C C C C
charge: -0.230356 -0.061402 -0.050623 -0.042029 0.056132 0.113681 0.296959 -0.066500 -0.050165 -0.183923 -0.092890 0.295677 0.015440
polarizability: 1.90417855e+02 -1.13398962e+01 1.22557854e+02 2.37182248e-01 -4.46856762e-01 6.44298938e+01
1716.lowfreq: -18.3789 -0.0004 0.0003 0.0007 4.2093 5.3534 31.5806 48.3311 73.2358
frequency: 31.4575 47.0356 73.2268 79.5598 102.6432 134.4354 182.6767 233.4521 250.9733 279.8451 311.8405 371.9962 387.9217 408.4980 412.8876 485.7666 498.1340 569.3508 587.4734 631.3605 670.0981 726.5905 758.2028 793.2089 814.0435 816.3687 855.2811 940.8327 958.5629 978.1921 995.1803 1003.9053 1023.0464 1073.4800 1102.6918 1104.6259 1129.7018 1140.6554 1159.7188 1179.6089 1197.2869 1232.5426 1256.4254 1272.4070 1305.7864 1310.5871 1371.1350 1396.7002 1431.6752 1434.7169 1437.0705 1445.4696 1466.0379 1482.4875 1494.5951 1502.3443 1563.4124 1599.9829 1622.4656 2875.8707 2893.9236 2961.0138 3013.1197 3016.1889 3040.5314 3075.9018 3117.4122 3153.0082 3153.9393 3175.6492 3431.5188 3576.8421
redmass: 3.6925 1.8476 4.0571 3.4913 5.5610 2.2697 3.4868 1.2545 5.9439 5.2039 4.1995 5.3604 1.1452 3.9308 2.7774 2.9807 3.7725 2.1836 6.4735 7.0441 1.4386 3.1881 4.2256 1.4230 1.3725 5.5222 1.4790 1.3638 2.1305 4.9739 1.3453 2.5681 1.6585 2.2925 1.3976 1.2891 1.7834 1.3998 2.9285 1.1400 1.5389 2.1453 2.7611 1.1316 1.5732 1.6032 1.5399 5.0033 3.0078 1.2007 1.1382 1.2147 1.0649 1.0774 1.0520 2.6620 7.5482 7.5219 6.3609 1.0562 1.0710 1.0616 1.0919 1.0757 1.0922 1.0999 1.0892 1.0912 1.0923 1.0970 1.0742 1.0660
irintensity: 0.3890 2.2376 0.7344 2.5748 1.1861 3.9451 3.1735 3.5007 1.0734 0.1049 4.0874 10.0967 145.6735 21.5557 5.2178 11.5422 7.7057 15.5784 23.5511 1.8057 106.3485 1.2436 2.5120 48.9359 2.3168 18.4522 38.6991 0.0779 20.1955 32.8731 0.7174 0.1895 10.3071 1.2719 58.7952 3.2688 7.8161 367.2276 29.4642 35.3352 9.4516 54.4000 31.6684 19.3601 19.9750 145.3983 55.3631 2.4166 10.5348 12.7245 8.7792 12.1816 10.6411 6.8070 12.8025 18.6713 206.6033 50.2785 119.9777 137.2436 94.6345 27.4258 8.7092 52.8104 31.2876 40.0688 17.1031 5.0750 5.5618 6.8713 2.6089 59.0485
temp: 298.150 k
press: 1.00000 atm
elementType: 8 8 7 6 6 6 6 6 6 6 6 6 6 1 1 1 1 1 1 1 1 1 1 1 1 1
symmnumber: 1
zpe: 553946.2 jmol-1
zpe.correction: 0.210987 hartree
zpe.thermalcorrener: 0.224296 hartree
zpe.thermalcorrenthalpy: 0.225240 hartree
zpe.thermalcorrgfe: 0.169825 hartree
zpe.sumelectzpe: -593.067831 hartree
zpe.sumelectthermal: -593.054522 hartree
zpe.sumelectthermalent: -593.053578 hartree
zpe.sumelectthermalfe: -593.108994 hartree
dipole: 1.1213 -4.1613 0.9984
dipole: 4.4239
quadrupole: -68.8481 -74.5361 -79.8553
quadrupole: -5.9348 -3.9508 -2.1843
quadrupole: 5.5651 -0.1230 -5.4421 -5.9348 -3.9508 -2.1843
hfenergy: -593.2788182 hartree
pointgroup: C01 [X(C10H13N1O2)]
dipole: 0.4299139 1.6330281 -0.4215481 debye
dipolederiv: -0.9133473 -0.1273118 -0.0044849 -0.422886 -0.8628992 0.0147439 -0.0061761 0.0188752 -0.3030473 -1.6161894 -0.4110128 -0.0036623 -0.4164026 -0.1785845 -0.0030399 -0.002048 -0.0027825 -0.4193455 -0.8135538 -0.0181034 -0.0451915 0.0287513 -0.4684508 -0.2069785 -0.0085342 -0.2389393 -0.2978975 -0.3777697 0.1491631 -0.0261852 0.3948385 -0.183025 -0.0105179 0.0176348 -0.040058 0.151741 0.4159314 -0.1628272 -0.0052824 -0.1933927 0.3388074 0.1205196 0.0986648 0.0739924 0.3176534 1.9597436 0.1706669 0.0182087 0.2172043 0.8910665 -0.0229496 0.0381593 -0.0205955 0.1153085 -1.0693482 -0.1842364 -0.0052708 -0.0666635 -0.2479183 0.0047554 -0.0247069 0.0040261 -0.0489876 0.3113283 0.1151842 -0.0005357 0.1988296 0.1505534 0.0002826 -0.0092693 0.0001993 -0.1035217 0.3244517 0.0677885 0.0005386 -0.1400535 0.0800871 -0.0011933 0.0096746 -0.0013792 -0.0892616 -0.6246148 -0.1137203 -0.0013541 0.317004 0.0639909 0.0001305 -0.0017343 -0.0008189 -0.2100851 -0.2953317 -0.1538087 0.0004048 -0.4752107 -0.1323134 -0.0022858 0.0044759 -0.0018551 -0.1774518 1.5529848 0.3963151 0.004381 0.347116 0.2756569 0.0004336 0.0036491 0.0006558 0.1009297 0.5164416 0.1289163 0.046173 0.2219258 0.2323184 0.0832117 -0.0792467 0.0926208 0.2673422 0.0220061 -0.0170177 0.0436 -0.0622561 0.0061612 0.0932277 0.0474813 0.1082988 -0.0405912 0.0583604 -0.020236 -0.0412345 -0.0896064 0.0294625 -0.0804949 -0.0844979 -0.0765715 -0.0145068 -0.0414621 0.0062113 -0.0339548 0.0564434 -0.0933441 -0.1295731 0.0192918 -0.1643591 -0.1271128 0.0619265 -0.0108046 0.0456891 -0.0110757 -0.0108135 0.0751574 0.0214238 0.090392 -0.0658482 0.1026304 0.0025097 0.056107 0.0280086 0.1838906 0.1006983 0.0704949 0.2116801 0.0475549 0.0283285 0.100344 -0.0005855 0.1191014 0.0129302 0.0017342 -0.0002652 0.0014687 0.1373498 0.1371468 -0.0540953 0.0000739 0.0011897 0.0021236 0.0002724 -0.0023133 0.0014135 0.1488363 0.0159248 -0.0860425 -0.0003436 -0.0866635 -0.0885991 0.0009111 -0.0000828 0.0007999 0.1745379 -0.0072525 0.0749796 -0.0014522 0.0751606 0.0326307 0.0012885 -0.0016054 0.0009823 0.1723025 -0.1226199 -0.0531554 -0.0396345 -0.2118007 -0.0671429 -0.1548119 -0.1452705 -0.1583545 -0.1185456 -0.1002086 0.1022083 0.0052282 0.171766 -0.0773462 -0.0010085 -0.019559 -0.0083518 0.1102835 0.0591085 -0.0075032 -0.0108768 -0.0936757 0.0264523 0.113561 0.0552225 0.1066849 -0.1153808 0.4153843 0.1055883 -0.0003554 0.092348 0.0843053 0.0019256 -0.000863 0.0019755 0.3877441 unknown
polarizability: 190.2355843|11.875736|122.7047755|0.0628251|-1.4858381|64.4652425 unknown
InChI: InChI=1S/C10H13NO2/c1-11-7-6-10(13)8-2-4-9(12)5-3-8/h2-5,11-12H,6-7H2,1H3
charge 0 multiplicity 1
26 atoms
O  -1.076089 -1.94463 0.039232
O  4.78363 0.696017 0.01338
N  -4.273517 0.883939 -0.035967
C  -1.859228 0.36206 -0.046139
C  -3.283423 -0.21445 -0.082728
C  -0.770432 -0.713525 -0.001778
C  0.665112 -0.284393 -0.000182
C  1.0613 1.079985 -0.007413
C  1.677516 -1.287169 0.01314
C  2.423691 1.436993 -0.002196
C  3.037846 -0.947353 0.016605
C  3.411147 0.419826 0.008908
C  -5.674916 0.431439 0.064818
H  -1.685439 1.01483 -0.927989
H  -1.768228 1.020617 0.841268
H  -3.396394 -0.880601 -0.971884
H  -3.435803 -0.858959 0.802379
H  -4.142939 1.540872 -0.818124
H  0.308706 1.874874 -0.012732
H  1.359386 -2.334831 0.021315
H  2.717703 2.494638 -0.005489
H  3.822441 -1.709249 0.02593
H  -5.99937 -0.255663 -0.755003
H  -6.34952 1.306073 0.068915
H  -5.818208 -0.104781 1.02115
H  4.954128 1.67094 0.009683
