program: Gaussian 09
title: 000090401
version: EM64L-G09RevD.01
frameworkgroup: C1[X(C13H19NO)]
method: RPBEPBE
basis: SDD
operation: Freq
keyword: #p
keyword: freq=noraman
keyword: PBEPBE/SDD
title: #p freq=noraman PBEPBE/SDD
converged: NO YES NO NO
title: Mulliken charges:
elementType: O N C C C C C C C C C C C C C H H H H H H H H H H H H H H H H H H H
charge: -0.227604 -0.116483 0.362261 -0.607868 -0.767813 -0.767418 0.156671 -0.643265 -0.644197 0.280284 -0.343061 -0.350034 -0.246835 -0.229945 -0.224912 0.244270 0.243467 0.228694 0.257564 0.199827 0.256649 0.199155 0.229455 0.246366 0.180212 0.217149 0.179808 0.246215 0.217922 0.248522 0.278241 0.229979 0.233304 0.233418
chargesum: 0.00000
title: Mulliken charges with hydrogens summed into heavy atoms:
elementType: O N C C C C C C C C C C C C C
charge: -0.227604 -0.116483 0.362261 -0.120131 -0.081727 -0.082159 0.156671 0.000462 -0.000252 0.280284 -0.094540 -0.071793 -0.016856 0.003360 0.008506
polarizability: 1.95197350e+02 4.93275706e+00 1.53079011e+02 7.93812453e-01 -4.97730937e-01 9.85373608e+01
1716.lowfreq: -2.6374 0.0004 0.0005 0.0007 5.1519 17.0098 26.4668 40.1885 63.8808
frequency: 26.3714 39.9793 63.7912 85.3135 108.5516 148.2585 189.8592 204.5854 207.5659 220.7177 250.3395 276.5214 312.0489 321.5402 342.4970 351.7474 400.4466 412.2331 421.9695 439.8583 468.6483 470.0563 493.7792 575.6506 613.0967 639.4694 697.5037 699.3344 765.4661 793.7667 799.0818 859.3792 887.3030 938.0808 942.8650 949.8221 974.5151 989.7910 992.0370 1007.0278 1010.9310 1012.9285 1028.5610 1037.5470 1083.3477 1085.3794 1122.1247 1130.7513 1148.4827 1173.2509 1188.2599 1201.5116 1211.7594 1231.2232 1257.5456 1291.9008 1310.3303 1329.0881 1365.2091 1382.3794 1386.5734 1419.5458 1420.1867 1435.3534 1443.6000 1458.5056 1464.2943 1474.2741 1477.1919 1479.1781 1483.6632 1489.4752 1493.5613 1510.9813 1570.8342 1597.9804 1612.0950 2832.5962 2848.0823 2953.9474 2986.4569 2990.4659 3004.6218 3019.6993 3020.5817 3075.7496 3081.1282 3095.1320 3099.0248 3112.9780 3118.9273 3128.0553 3138.4997 3150.6257 3159.4854 3169.3740
redmass: 3.7870 3.1881 2.3517 3.9414 3.4209 4.8220 3.4623 1.5478 2.0044 1.0926 1.2754 1.1695 5.1535 1.9115 2.9610 1.9019 2.8214 3.2906 2.0465 4.8887 2.6917 2.3864 3.2919 2.8183 6.4216 5.8772 1.8229 3.6264 1.6806 4.5710 3.2584 1.2645 1.9474 1.4092 2.5198 1.4247 2.5051 6.1893 1.3768 1.3942 2.6524 1.3704 1.9216 1.4354 1.2589 1.5978 1.9724 1.5029 1.7430 1.0687 1.1282 2.3319 2.8064 2.9589 2.6077 2.2295 1.4859 1.5594 1.2360 1.2071 9.3107 1.1233 1.1113 2.2357 1.1565 1.0500 1.0503 1.0756 2.0706 1.0509 1.0761 1.0474 1.0525 1.0553 6.3386 6.5448 6.5741 1.0592 1.0598 1.0589 1.0371 1.0379 1.0963 1.0734 1.0718 1.0995 1.0983 1.0957 1.0961 1.0985 1.0976 1.0851 1.0882 1.0923 1.0957 1.1011
irintensity: 0.2206 0.0170 0.0466 0.1581 4.1790 0.0054 0.0395 5.1637 0.8733 0.5678 0.5802 1.0491 9.9098 0.2183 7.8511 0.9373 0.0554 0.7218 0.2139 0.7804 0.0236 0.6025 12.7844 8.3714 0.0301 30.7804 48.4815 1.0760 59.7221 3.4866 5.5697 0.4855 1.4161 0.7205 14.7627 2.0971 51.7352 2.4464 0.5610 1.2752 29.9476 0.1950 1.4708 11.3830 7.2140 9.7099 1.6318 34.2060 74.8101 0.9722 21.7316 6.0231 17.0730 107.5463 25.8539 10.1911 46.8362 126.1077 29.5899 50.5463 3.0441 2.6833 2.1005 22.8442 9.6703 0.5623 11.1103 38.2291 1.3737 1.6470 15.4476 14.0265 17.4310 3.9372 77.3179 36.6605 11.9565 65.7479 168.5906 40.8857 41.8650 6.2065 15.1153 16.9454 109.0532 7.6152 65.4734 37.6177 18.4354 2.1771 17.8580 0.0998 7.4654 17.3223 22.7818 20.7123
temp: 298.150 k
press: 1.00000 atm
elementType: 8 7 6 6 6 6 6 6 6 6 6 6 6 6 6 1 1 1 1 1 1 1 1 1 1 1 1 1 1 1 1 1 1 1
symmnumber: 1
zpe: 760741.8 jmol-1
zpe.correction: 0.289751 hartree
zpe.thermalcorrener: 0.305666 hartree
zpe.thermalcorrenthalpy: 0.306611 hartree
zpe.thermalcorrgfe: 0.246253 hartree
zpe.sumelectzpe: -635.584294 hartree
zpe.sumelectthermal: -635.568378 hartree
zpe.sumelectthermalent: -635.567434 hartree
zpe.sumelectthermalfe: -635.627792 hartree
dipole: 1.6636 3.2660 -0.0078
dipole: 3.6653
quadrupole: -83.7564 -91.4675 -93.1741
quadrupole: -0.7586 0.2760 -0.1995
quadrupole: 5.7096 -2.0015 -3.7081 -0.7586 0.2760 -0.1995
hfenergy: -635.8740448 hartree
pointgroup: C01 [X(C13H19N1O1)]
dipole: -0.702841 1.2198569 -0.3120708 debye
polarizability: 195.1849698|-1.9644068|150.2476893|6.2962057|-11.3700882|101.3810629 unknown
InChI: InChI=1S/C13H19NO/c1-13(2,14(3)4)10-12(15)11-8-6-5-7-9-11/h5-9H,10H2,1-4H3
charge 0 multiplicity 1
34 atoms
O  -0.162084 -1.998512 0.540789
N  3.300455 0.775335 0.046758
C  2.299541 -0.338583 0.263195
C  0.838141 0.205801 0.09378
C  2.501415 -0.921035 1.68636
C  2.58338 -1.465782 -0.764557
C  -0.328157 -0.776039 0.251647
C  3.315071 1.85223 1.057475
C  3.372283 1.335915 -1.317801
C  -1.727546 -0.244681 0.048745
C  -2.000029 1.116842 -0.256286
C  -2.814267 -1.153713 0.170348
C  -3.3292 1.556993 -0.43555
C  -4.140484 -0.714908 -0.009589
C  -4.402009 0.64337 -0.313703
H  0.7419 0.67126 -0.909551
H  0.674431 1.029264 0.821012
H  3.571946 -1.144332 1.841611
H  1.916016 -1.847986 1.788145
H  2.16831 -0.228198 2.480354
H  2.011173 -2.365678 -0.490738
H  2.291507 -1.186549 -1.79345
H  3.662441 -1.701247 -0.757101
H  3.4272 1.436942 2.071132
H  2.409274 2.512427 1.049953
H  4.189805 2.501428 0.867561
H  2.48071 1.944362 -1.619603
H  3.508068 0.53614 -2.062245
H  4.253798 2.000553 -1.381149
H  -1.181377 1.837057 -0.353596
H  -2.584858 -2.198148 0.406597
H  -3.530084 2.608222 -0.669733
H  -4.96989 -1.424265 0.08547
H  -5.433179 0.986514 -0.454378
