program: Gaussian 09
title: 000090397
version: EM64L-G09RevD.01
frameworkgroup: C1[X(C11H15NO2)]
method: RPBEPBE
basis: SDD
operation: Freq
keyword: #p
keyword: freq=noraman
keyword: PBEPBE/SDD
title: #p freq=noraman PBEPBE/SDD
converged: YES YES NO NO
title: Mulliken charges:
elementType: O O N C C C C C C C C C C C H H H H H H H H H H H H H H H
charge: -0.192260 -0.380758 -0.282584 -0.387483 -0.523734 0.127525 -0.319853 0.191570 0.180790 -0.304906 -0.692340 -0.406369 -0.284067 -0.195477 0.201068 0.233929 0.221739 0.248865 0.234878 0.179342 0.213228 0.252908 0.230907 0.200660 0.212189 0.219240 0.233221 0.233056 0.354715
chargesum: 0.00000
title: Mulliken charges with hydrogens summed into heavy atoms:
elementType: O O N C C C C C C C C C C C
charge: -0.192260 -0.026044 -0.047705 0.047514 -0.053130 0.127525 0.072717 0.191570 0.180790 -0.051998 -0.048584 -0.187129 -0.050845 0.037579
polarizability: 1.87216814e+02 -7.07777468e+00 1.42495502e+02 5.49030117e+00 9.66783691e-01 7.48840294e+01
1716.lowfreq: -6.1631 -4.0455 -0.0009 -0.0007 -0.0004 7.6972 17.4719 47.7870 54.4510
frequency: 17.1590 47.7671 54.3368 65.3370 104.4423 136.3690 142.2320 172.7970 209.0452 235.0935 250.2426 268.6038 375.9321 403.5229 407.6343 423.8614 432.8763 496.8427 512.8613 552.7305 580.4871 638.7812 681.7034 730.7019 755.0192 757.2825 805.0386 815.4050 818.8614 847.4539 906.0734 941.5149 964.5813 978.4207 1027.2917 1035.7982 1046.1382 1075.7611 1095.9850 1115.5842 1123.0862 1150.3641 1164.0180 1176.8809 1199.8836 1214.9223 1250.9229 1257.7980 1279.4387 1293.2182 1303.8560 1341.7617 1385.3641 1393.7878 1394.9747 1425.6890 1442.5230 1445.8232 1471.7483 1480.2601 1486.2419 1489.9841 1498.7128 1570.9820 1607.2856 1607.8126 2857.2529 2892.4343 2967.3983 2976.9410 3001.3549 3016.8956 3045.8170 3069.0834 3091.7041 3108.8142 3141.3685 3155.6649 3173.4882 3406.8937 3537.8831
redmass: 5.6499 3.7258 2.0671 3.1903 3.3332 2.2424 2.4475 4.0235 5.0950 4.4840 1.1574 5.0570 6.5169 1.7734 2.7395 2.1198 3.1958 3.3424 3.3396 7.0182 2.5974 4.9277 1.6028 2.6457 1.3909 3.9024 1.1842 1.9620 2.1051 1.4995 1.7703 1.3707 4.4300 1.3324 1.8936 2.9106 2.2881 2.5202 1.8761 1.7489 1.6897 2.9123 1.2727 1.0740 1.7021 2.1777 2.1288 1.4389 1.2079 1.4271 1.4832 1.4542 1.3037 3.3030 1.7636 2.1107 1.1460 1.1857 1.0554 1.0585 1.1045 2.2451 1.0879 7.1069 7.1077 6.7730 1.0722 1.0717 1.0599 1.0378 1.0864 1.0949 1.0917 1.0976 1.1002 1.0891 1.0878 1.0928 1.0996 1.0738 1.0656
irintensity: 2.7233 1.1108 1.6136 2.1078 0.1791 3.8128 4.0818 0.5672 1.9162 3.8888 0.3755 7.8691 8.3996 75.2930 23.0183 32.8803 3.5007 15.9928 10.1958 3.5760 0.2023 18.9406 75.2989 14.5149 97.5116 9.3680 2.1380 19.2344 10.7454 2.3347 3.7695 2.0070 61.7798 0.1887 12.8889 2.1559 0.7953 30.4443 95.3557 18.1284 13.7061 82.2642 34.1248 7.2970 27.5805 84.6738 44.2918 30.4133 15.6094 31.4405 45.7353 72.7970 27.1919 14.8613 1.9170 21.5882 23.3334 18.4080 15.4414 7.8694 1.4465 13.9616 4.5376 112.5316 22.8864 107.8191 114.3643 86.6200 26.6048 32.9785 28.1993 6.8342 31.3448 59.9796 39.5755 14.5017 4.2840 19.6189 15.7538 3.7997 24.5376
temp: 298.150 k
press: 1.00000 atm
elementType: 8 8 7 6 6 6 6 6 6 6 6 6 6 6 1 1 1 1 1 1 1 1 1 1 1 1 1 1 1
symmnumber: 1
zpe: 627010.1 jmol-1
zpe.correction: 0.238816 hartree
zpe.thermalcorrener: 0.253437 hartree
zpe.thermalcorrenthalpy: 0.254381 hartree
zpe.thermalcorrgfe: 0.195293 hartree
zpe.sumelectzpe: -632.282247 hartree
zpe.sumelectthermal: -632.267625 hartree
zpe.sumelectthermalent: -632.266681 hartree
zpe.sumelectthermalfe: -632.325770 hartree
dipole: 2.6152 -2.3806 1.6484
dipole: 3.9018
quadrupole: -59.9471 -84.5659 -85.9800
quadrupole: 1.7562 -0.8253 1.0937
quadrupole: 16.8839 -7.7349 -9.1490 1.7562 -0.8253 1.0937
hfenergy: -632.5210622 hartree
pointgroup: C01 [X(C11H15N1O2)]
dipole: -1.0604795 -0.9570918 -0.5619576 debye
polarizability: 187.6655584|6.1355238|141.4580541|4.070036|-6.7739029|75.4727339 unknown
InChI: InChI=1S/C11H15NO2/c1-2-12-8-7-11(14)9-5-3-4-6-10(9)13/h3-6,12-13H,2,7-8H2,1H3
charge 0 multiplicity 1
29 atoms
O  0.134946 1.922259 0.164851
O  -2.496706 2.196864 -0.478461
N  3.628051 -0.472057 -0.153987
C  2.499411 0.486363 -0.168113
C  1.165653 -0.268587 -0.04747
C  -0.044843 0.677048 0.040562
C  4.965903 0.16382 -0.142367
C  -1.415569 0.060277 -0.009107
C  -2.60444 0.827176 -0.236022
C  -1.574945 -1.340783 0.196101
C  6.079669 -0.896419 -0.166371
C  -3.877359 0.199042 -0.23995
C  -2.835868 -1.966114 0.199223
C  -3.995512 -1.186002 -0.019726
H  2.479695 1.139128 -1.074094
H  2.607858 1.167609 0.695171
H  1.031567 -0.962115 -0.903269
H  1.212716 -0.904854 0.859721
H  3.554347 -1.150335 -0.927756
H  5.110355 0.876013 -0.994566
H  5.044911 0.764927 0.784776
H  -0.68507 -1.95183 0.3727
H  5.975501 -1.582005 0.692935
H  6.037651 -1.500137 -1.093912
H  7.076126 -0.421075 -0.121201
H  -4.776394 0.804831 -0.417167
H  -2.917188 -3.043727 0.371675
H  -4.986283 -1.653041 -0.02115
H  -3.393683 2.585526 -0.647523
