program: Gaussian 09
title: 000090399
version: EM64L-G09RevD.01
frameworkgroup: C1[X(C16H17NO2)]
method: RPBEPBE
basis: SDD
operation: Freq
keyword: #p
keyword: freq=noraman
keyword: PBEPBE/SDD
title: #p freq=noraman PBEPBE/SDD
converged: YES YES NO NO
title: Mulliken charges:
elementType: O O N C C C C C C C C C C C C C C C C H H H H H H H H H H H H H H H H H
charge: -0.192126 -0.379561 -0.303202 -0.381887 -0.529940 -0.478920 0.422660 0.130994 0.189365 -0.438739 -0.385907 0.181976 -0.304259 -0.223392 -0.224200 -0.406693 -0.285114 -0.244192 -0.194782 0.237038 0.200265 0.248231 0.223163 0.196123 0.227044 0.246279 0.231987 0.270019 0.253684 0.223438 0.222634 0.219724 0.233726 0.225766 0.233646 0.355155
chargesum: 0.00000
title: Mulliken charges with hydrogens summed into heavy atoms:
elementType: O O N C C C C C C C C C C C C C C C C
charge: -0.192126 -0.024407 -0.056924 0.055416 -0.058545 -0.055753 0.422660 0.130994 0.189365 -0.206753 -0.115888 0.181976 -0.050575 0.000046 -0.001566 -0.186969 -0.051388 -0.018426 0.038864
polarizability: 2.62393751e+02 5.10486174e-01 1.93132255e+02 -4.10232882e+00 7.25619912e+00 9.95991326e+01
1716.lowfreq: -9.9347 -2.0785 0.0004 0.0005 0.0007 2.1572 12.1769 20.3755 28.0265
frequency: 11.6260 20.3667 28.0251 33.1565 59.9648 102.1800 109.5496 123.4885 149.1917 166.1045 206.4406 233.3167 251.9536 308.8942 360.2323 382.4338 405.4677 409.1329 426.4313 430.1797 475.4006 497.1948 511.2810 552.8832 581.0596 592.3475 616.3896 644.2067 692.5149 709.5674 730.8347 748.1026 754.9909 756.6479 808.6436 812.2613 819.0312 847.5922 858.4318 913.9508 941.5085 963.4427 970.7252 978.9220 981.0203 989.7445 996.0818 1013.0602 1025.4399 1045.4096 1066.9531 1078.8545 1085.5706 1105.5828 1139.9624 1156.4881 1164.9400 1169.2801 1177.1740 1180.8866 1203.2684 1213.5728 1232.9043 1253.1403 1271.3470 1290.5009 1298.9721 1314.2634 1339.5196 1378.6332 1393.4446 1394.7887 1426.1823 1439.4120 1441.4745 1448.9287 1475.2877 1483.3743 1488.8504 1490.7542 1570.3064 1593.6438 1607.0062 1608.0976 1614.5895 2863.7075 2896.8308 2967.5975 2973.7359 3017.0424 3043.0149 3109.0800 3112.4492 3122.4401 3136.0620 3141.7409 3150.1862 3156.3223 3161.9265 3174.1276 3423.0322 3534.9386
redmass: 5.1222 4.1160 5.5329 5.2448 3.3455 3.9428 4.0523 2.1890 2.6329 6.1406 4.6693 4.3855 3.8359 4.6780 4.9229 6.0464 2.8527 1.7130 1.9991 2.7437 3.7069 3.2957 3.2342 7.0839 2.6025 4.9779 6.2935 5.8059 1.6036 1.7001 2.6271 1.5710 1.3881 4.4624 1.9883 2.0450 5.3265 1.5075 1.2475 1.3461 1.3754 3.6382 2.1726 1.3375 1.3870 6.1997 1.3816 2.0761 2.1620 2.3148 2.2668 1.5894 2.2397 2.2207 3.8297 1.1469 1.2556 1.0594 1.0697 1.1101 2.0434 2.4481 1.5035 2.6278 1.3214 1.3714 1.4361 1.4684 1.4561 2.9471 2.5670 4.4342 2.0766 2.0163 1.1939 1.2171 1.3336 1.5901 1.9263 1.2692 7.1252 6.1735 7.2973 6.6170 6.1244 1.0710 1.0717 1.0599 1.0863 1.0945 1.0926 1.0891 1.0866 1.0867 1.0923 1.0880 1.0951 1.0928 1.1009 1.0994 1.0742 1.0656
irintensity: 0.8455 0.7407 2.2829 0.9665 1.0270 0.1041 2.7954 3.1751 5.0754 1.0524 5.2014 4.0381 0.3460 4.0608 4.2723 19.3082 0.1541 68.6695 29.6201 24.5886 11.0811 15.5427 6.0313 3.1985 0.3065 6.9599 0.6041 15.3547 55.9984 63.7781 15.6624 60.2883 97.2197 9.7023 4.2093 2.3056 20.7538 1.8899 0.1163 5.9670 3.0799 72.8265 9.6021 0.1524 0.3221 0.0283 1.7453 11.2523 10.6044 0.4464 4.7265 9.4679 67.2263 71.4698 80.9827 7.5418 33.1946 0.4420 8.9865 1.2484 71.8765 4.5550 79.7711 21.0083 35.0106 23.4017 24.3087 63.6541 59.1841 15.2450 1.0503 13.1096 19.8039 15.6930 23.0966 31.6048 19.1177 10.1857 12.5603 3.5700 118.5033 0.6843 31.1324 101.7457 6.5449 82.7135 88.8183 25.2065 24.1690 5.5468 32.1119 14.6437 8.4235 0.7622 29.1154 4.4748 31.0424 20.5023 22.4602 14.7447 0.9885 24.6359
temp: 298.150 k
press: 1.00000 atm
elementType: 8 8 7 6 6 6 6 6 6 6 6 6 6 6 6 6 6 6 6 1 1 1 1 1 1 1 1 1 1 1 1 1 1 1 1 1
symmnumber: 1
zpe: 763391.0 jmol-1
zpe.correction: 0.290760 hartree
zpe.thermalcorrener: 0.308489 hartree
zpe.thermalcorrenthalpy: 0.309433 hartree
zpe.thermalcorrgfe: 0.240958 hartree
zpe.sumelectzpe: -823.703202 hartree
zpe.sumelectthermal: -823.685473 hartree
zpe.sumelectthermalent: -823.684529 hartree
zpe.sumelectthermalfe: -823.753003 hartree
dipole: -2.9623 2.5282 -1.8045
dipole: 4.2922
quadrupole: -78.8436 -109.4799 -115.4096
quadrupole: -5.2795 0.6804 4.2193
quadrupole: 22.4007 -8.2355 -14.1652 -5.2795 0.6804 4.2193
hfenergy: -823.9939618 hartree
pointgroup: C01 [X(C16H17N1O2)]
dipole: 1.1950494 -1.0391144 -0.5862552 debye
polarizability: 261.8649165|1.8716808|191.4237033|9.9811611|-14.4364307|101.8365184 unknown
InChI: InChI=1S/C16H17NO2/c18-15-9-5-4-8-14(15)16(19)10-11-17-12-13-6-2-1-3-7-13/h1-9,17-18H,10-12H2
charge 0 multiplicity 1
36 atoms
O  2.153521 2.044856 0.555458
O  4.832237 1.938906 0.121168
N  -1.664146 0.339235 -0.137107
C  -0.391401 1.082885 -0.011175
C  0.787672 0.099067 0.0555
C  -2.873077 1.192977 -0.117406
C  -4.156965 0.370161 -0.133114
C  2.133381 0.808503 0.291548
C  3.382988 -0.02271 0.210794
C  -5.291608 0.820501 -0.85302
C  -4.246243 -0.84389 0.59522
C  4.6950 0.551363 0.152564
C  3.295679 -1.445237 0.208818
C  -6.497802 0.082465 -0.83648
C  -5.44831 -1.585606 0.609201
C  5.844002 -0.280898 0.104458
C  4.432745 -2.273183 0.167017
C  -6.580118 -1.124207 -0.104286
C  5.717212 -1.68228 0.115288
H  -0.421225 1.67695 0.920345
H  -0.218998 1.814053 -0.837144
H  0.593423 -0.618643 0.878461
H  0.84373 -0.503674 -0.874273
H  -2.902896 1.933164 -0.9556
H  -2.828648 1.791748 0.816302
H  -1.666697 -0.284953 -0.956968
H  -5.231398 1.753063 -1.428656
H  -3.360841 -1.191161 1.138313
H  2.30801 -1.912807 0.255108
H  -7.367096 0.444647 -1.397407
H  -5.504925 -2.521629 1.177203
H  6.840456 0.179125 0.058546
H  4.323441 -3.36198 0.176491
H  -7.512957 -1.699444 -0.092479
H  6.615148 -2.308645 0.081922
H  5.790703 2.186277 0.053391
