program: Gaussian 09
title: 000090433
version: EM64L-G09RevD.01
frameworkgroup: C1[X(C17H19NO2)]
method: RPBEPBE
basis: SDD
operation: Freq
keyword: #p
keyword: freq=noraman
keyword: PBEPBE/SDD
title: #p freq=noraman PBEPBE/SDD
converged: YES YES NO NO
title: Mulliken charges:
elementType: O O N C C C C C C C C C C C C C C C C C H H H H H H H H H H H H H H H H H H H
charge: -0.235341 -0.258079 -0.302708 -0.375086 -0.529302 -0.478527 0.116316 0.421812 0.287771 -0.437442 -0.387107 -0.317811 -0.355116 -0.374655 -0.358224 0.332248 -0.223528 -0.224024 -0.244051 -0.536827 0.233413 0.201311 0.254685 0.219249 0.196127 0.226887 0.246455 0.231866 0.270698 0.248713 0.276502 0.253927 0.245189 0.223575 0.222900 0.225911 0.226729 0.226344 0.249196
chargesum: 0.00000
title: Mulliken charges with hydrogens summed into heavy atoms:
elementType: O O N C C C C C C C C C C C C C C C C C
charge: -0.235341 -0.258079 -0.056253 0.059639 -0.055368 -0.055512 0.116316 0.421812 0.287771 -0.205576 -0.116409 -0.069097 -0.078613 -0.120728 -0.113035 0.332248 0.000047 -0.001124 -0.018140 0.165441
polarizability: 3.07818781e+02 -8.77078723e+00 1.92432629e+02 9.54080655e+00 -5.08907725e+00 1.08570400e+02
1716.lowfreq: -1.3836 -0.0006 0.0003 0.0005 3.6529 12.2499 17.3678 25.7309 27.2935
frequency: 17.2198 25.7040 27.2789 39.6077 74.7156 81.2789 94.2665 111.2795 129.1505 146.9672 157.3391 179.9533 224.2748 230.0806 276.2118 295.4081 315.5116 338.0102 404.5809 413.6871 415.5536 445.7699 485.8626 490.4223 514.7387 570.9979 575.0668 598.5340 617.1873 628.0505 690.1556 708.9258 732.8361 744.7833 748.0805 799.6759 801.6303 810.8306 824.4325 845.2399 858.2334 913.5339 963.9250 968.5599 976.7306 981.1573 983.5534 984.8579 989.5801 996.2898 1003.3315 1014.6260 1025.6646 1070.7400 1078.8028 1097.5654 1112.4605 1113.6836 1140.0629 1157.6447 1158.0342 1169.1856 1172.0992 1179.4784 1209.8270 1217.0930 1238.9011 1240.4292 1275.8504 1293.1606 1300.8902 1316.2551 1342.8076 1373.3830 1379.8374 1394.9882 1427.9097 1436.5280 1438.9416 1440.3409 1450.6810 1469.3615 1472.4598 1475.4924 1483.3549 1490.0296 1499.8113 1558.0129 1585.9305 1593.7336 1615.2254 1621.7904 2864.6203 2899.3911 2964.4472 2968.3890 2972.2658 3014.2888 3039.4947 3059.8174 3112.2257 3122.7157 3132.0310 3136.2795 3146.6340 3147.4474 3150.3620 3162.1482 3167.1296 3172.4420 3422.9597
redmass: 3.9421 4.1872 4.6706 4.4720 3.3938 4.4276 3.8633 2.1069 3.5748 2.8780 5.7230 4.1685 1.1885 3.5633 3.3360 3.7185 5.0444 6.0533 2.9261 4.1928 2.9556 3.6810 3.3812 3.0453 3.9143 2.6194 4.1471 4.9331 6.2999 7.0725 1.5794 1.7487 3.1245 3.1689 1.7811 1.6636 3.8835 3.5211 1.2465 1.6247 1.2481 1.3446 1.3718 1.8911 5.0115 1.4073 7.0313 1.3762 6.2063 1.3778 2.4686 2.0571 2.1378 2.0336 1.5872 2.8083 1.2593 1.3369 3.8072 1.1844 1.2854 1.0644 1.2494 1.1095 2.0581 1.8266 2.6539 1.7644 1.1867 1.4712 1.3180 1.5259 1.5694 4.7086 3.2562 2.1013 3.5428 1.2192 1.2318 1.8614 1.2163 1.0500 1.0719 1.3036 1.6127 1.1426 2.4720 7.7754 7.5208 6.1732 6.1587 6.6667 1.0711 1.0713 1.0613 1.0326 1.0863 1.0926 1.0929 1.1043 1.0868 1.0866 1.1000 1.0923 1.0879 1.0876 1.0951 1.1009 1.0953 1.0968 1.0743
irintensity: 0.2511 0.1289 0.3907 1.5165 2.8290 0.0850 1.5257 2.7246 11.0447 1.0909 2.8126 10.0854 0.1229 1.2973 1.7705 2.0508 3.4740 1.8158 0.9594 3.8166 0.1414 14.0607 5.6011 7.4125 3.5720 19.0893 26.0476 2.4456 0.5412 3.5406 64.2985 62.0173 1.2886 15.5184 52.9642 22.9322 12.9374 10.6372 0.3629 53.5218 0.1107 6.3016 3.1127 34.0604 99.4459 1.3051 9.5717 1.5113 0.0965 0.9823 1.7541 5.4104 11.0869 0.1072 11.5500 4.3580 0.2607 15.7861 106.4078 11.7661 0.5437 3.6378 188.1665 0.2371 13.0005 12.6356 80.6863 185.6529 29.3044 37.1817 0.4186 89.9596 93.7644 37.3655 48.5426 5.4830 1.3439 27.5540 3.0078 5.4560 30.8109 15.7340 53.8952 17.2375 9.7066 2.7963 22.4404 103.6219 174.4843 0.6056 10.7132 141.8942 85.9790 87.4240 29.0514 66.0243 24.4941 6.6091 33.0570 42.7260 8.7829 0.6313 22.5722 28.5163 0.2230 9.6945 30.6732 23.3500 16.3739 4.9298 1.0174
temp: 298.150 k
press: 1.00000 atm
elementType: 8 8 7 6 6 6 6 6 6 6 6 6 6 6 6 6 6 6 6 6 1 1 1 1 1 1 1 1 1 1 1 1 1 1 1 1 1 1 1
symmnumber: 1
zpe: 837620.5 jmol-1
zpe.correction: 0.319033 hartree
zpe.thermalcorrener: 0.338193 hartree
zpe.thermalcorrenthalpy: 0.339137 hartree
zpe.thermalcorrgfe: 0.268135 hartree
zpe.sumelectzpe: -862.926323 hartree
zpe.sumelectthermal: -862.907163 hartree
zpe.sumelectthermalent: -862.906219 hartree
zpe.sumelectthermalfe: -862.977221 hartree
dipole: 3.1938 -1.4755 -1.1409
dipole: 3.6985
quadrupole: -80.6972 -122.1537 -120.9418
quadrupole: 1.0159 4.6422 -3.0657
quadrupole: 27.2337 -14.2228 -13.0109 1.0159 4.6422 -3.0657
hfenergy: -863.2453559 hartree
pointgroup: C01 [X(C17H19N1O2)]
dipole: 1.2576212 -0.6999267 -0.2141146 debye
polarizability: 307.1572385|-5.3550766|180.9931977|15.7518771|-29.4844967|120.6713746 unknown
InChI: InChI=1S/C17H19NO2/c1-20-16-9-7-15(8-10-16)17(19)11-12-18-13-14-5-3-2-4-6-14/h2-10,18H,11-13H2,1H3
charge 0 multiplicity 1
39 atoms
O  1.484716 2.453379 -0.376925
O  6.527424 -1.513018 0.41868
N  -2.249013 0.397214 -0.303764
C  -1.034597 1.231042 -0.439707
C  0.218315 0.380813 -0.178596
C  -3.520661 1.142389 -0.436957
C  1.515675 1.194391 -0.213768
C  -4.734807 0.257548 -0.174448
C  2.817799 0.476132 -0.045483
C  -5.929739 0.438456 -0.914784
C  -4.697874 -0.741104 0.832332
C  2.906297 -0.928845 0.17768
C  4.022128 1.226285 -0.109116
C  4.151127 -1.557776 0.328582
C  5.278659 0.612183 0.038083
C  5.343553 -0.790102 0.257959
C  -7.071646 -0.351784 -0.648013
C  -5.835496 -1.535569 1.096983
C  -7.028053 -1.342494 0.359896
C  7.796476 -0.777869 0.35756
H  -1.083122 2.045613 0.306284
H  -0.944377 1.729362 -1.434303
H  0.117293 -0.110439 0.810456
H  0.287038 -0.442342 -0.920694
H  -3.638574 1.638175 -1.432793
H  -3.492315 1.962884 0.31033
H  -2.230253 -0.417176 -0.934846
H  -5.967057 1.201059 -1.703244
H  -3.766685 -0.882353 1.391217
H  1.998208 -1.537217 0.238512
H  3.9425 2.305646 -0.277853
H  4.233263 -2.634843 0.501712
H  6.188039 1.217551 -0.017844
H  -7.988895 -0.199112 -1.228352
H  -5.794432 -2.303621 1.878224
H  -7.910769 -1.958563 0.565988
H  7.857702 -0.018395 1.160209
H  7.930621 -0.292879 -0.628148
H  8.574332 -1.540421 0.506351
