program: Gaussian 09
title: 000090385
version: EM64L-G09RevD.01
frameworkgroup: C1[X(C7H5N3O)]
method: RPBEPBE
basis: SDD
operation: Freq
keyword: #pfreq=noraman
keyword: PBEPBE/SDD
title: #p freq=noraman PBEPBE/SDD
converged: YES YES NO YES
title: Mulliken charges:
elementType: O N N N C C C C C C C H H H H H
charge: -0.206538 -0.066110 -0.002182 -0.041229 0.385926 0.278009 -0.346539 -0.339378 -0.342606 -0.312167 -0.201139 0.241096 0.277463 0.259941 0.248282 0.167172
chargesum: 0.00000
title: Mulliken charges with hydrogens summed into heavy atoms:
elementType: O N N N C C C C C C C
charge: -0.206538 -0.066110 -0.002182 -0.041229 0.385926 0.278009 -0.105443 -0.061915 -0.082665 -0.063885 -0.033967
polarizability: 2.00316183e+02 1.36207258e+01 1.00097988e+02 -3.31945814e-03 3.33863850e-03 3.74678956e+01
1716.lowfreq: -8.4324 0.0005 0.0007 0.0008 6.4068 9.6383 67.8884 107.2833 112.7541
frequency: 67.8881 107.2822 112.7518 199.4961 204.2485 326.6222 335.8995 399.7132 417.2544 461.3667 508.9129 541.9629 624.6226 634.9225 728.4574 756.8270 829.0584 840.6233 842.1679 960.4970 987.2512 1001.7222 1002.1029 1094.2959 1115.1350 1175.2200 1221.9771 1299.6994 1327.5161 1358.9500 1399.1885 1428.0720 1492.6595 1562.5899 1599.9182 1624.1318 2046.8684 2873.3524 3131.1327 3134.9653 3158.1229 3173.2795
redmass: 6.2207 11.0623 8.7238 3.3784 7.1372 3.7988 9.1062 7.1826 2.8981 13.2624 2.6846 7.0211 7.2542 9.2060 3.3319 6.3241 5.6045 1.2740 1.4873 1.4258 1.4097 1.6345 2.8694 5.0887 1.3476 1.1796 2.5139 1.3190 6.2164 2.4826 1.8222 4.0944 2.6686 8.0766 5.9947 6.9069 13.9629 1.0850 1.0898 1.0885 1.0966 1.0958
irintensity: 0.4919 1.4854 5.9803 4.8921 10.4132 5.8399 0.8505 1.2668 0.8760 0.6872 21.9986 21.3929 0.0946 1.3870 0.1090 32.3022 36.0073 10.6787 67.6548 3.9739 0.3180 6.2333 0.7405 16.1158 17.6546 60.3137 67.9912 13.9761 159.4757 11.7679 13.0008 16.2049 41.3985 122.6869 366.6489 42.0863 603.9753 138.1470 10.5307 1.1268 3.5233 4.2517
temp: 298.150 k
press: 1.00000 atm
elementType: 8 7 7 7 6 6 6 6 6 6 6 1 1 1 1 1
symmnumber: 1
zpe: 287754.1 jmol-1
zpe.correction: 0.109600 hartree
zpe.thermalcorrener: 0.118796 hartree
zpe.thermalcorrenthalpy: 0.119740 hartree
zpe.thermalcorrgfe: 0.074576 hartree
zpe.sumelectzpe: -508.392635 hartree
zpe.sumelectthermal: -508.383439 hartree
zpe.sumelectthermalent: -508.382495 hartree
zpe.sumelectthermalfe: -508.427659 hartree
dipole: -1.2838 2.1823 0.0009
dipole: 2.5319
quadrupole: -80.9789 -58.8879 -64.3163
quadrupole: 8.3111 0.0078 0.0054
quadrupole: -12.9179 9.1732 3.7447 8.3111 0.0078 0.0054
hfenergy: -508.5022352 hartree
pointgroup: C01 [X(C7H5N3O1)]
dipole: 0.5633257 0.8215528 0.0000229 debye
dipolederiv: -1.1232515 -0.1288294 -0.0198007 -0.683781 -0.5774914 -0.0144828 -0.0093379 0.0010859 -0.3347251 -1.4262088 0.4600741 -0.0447489 0.9624808 -0.6496064 0.0363433 -0.054009 0.0223619 -0.1358662 1.2550136 -0.7944458 0.0472477 -1.6112082 0.8865175 -0.0597427 0.0620879 -0.0367272 0.0940462 -0.9195508 0.3897614 -0.0310372 0.8162849 -0.4017512 0.0290539 -0.0385027 0.0168673 -0.0720486 -1.1636188 0.041824 -0.0338106 0.0680845 -0.14162 0.0048258 -0.0348171 0.0040837 0.0016436 1.5368332 -0.1968613 0.043255 -0.1508765 0.2485449 -0.0066148 0.0421566 -0.0078576 0.1242114 0.4378927 -0.1212558 0.0186883 0.1565421 0.0945168 -0.0000936 0.0133718 -0.0080089 -0.1401162 0.2561843 0.0606894 0.0084623 -0.1411437 0.0804409 -0.0071487 0.012482 -0.0014918 -0.0837051 -0.4917023 0.1808729 -0.0127854 0.3681257 -0.0092466 0.0075399 -0.0163217 0.0022607 -0.1577828 -0.4545354 -0.0638516 -0.0069491 -0.3145914 -0.0434794 -0.0111071 -0.0021899 -0.0040528 -0.1616763 1.9522534 0.0641202 0.0511962 0.2713116 0.7555746 -0.0053913 0.047751 -0.0110967 0.1085133 0.03156 0.1089587 -0.0056486 0.0698489 -0.0236272 0.0054312 -0.0049404 0.0065774 0.1561371 0.0775221 -0.0589736 -0.0010226 -0.0181755 0.0159917 0.0021158 -0.0018388 0.0009749 0.1535068 0.0574006 -0.0799649 -0.0017025 -0.0720765 0.004656 0.0011464 -0.001825 0.0009584 0.1707666 0.0014557 0.0880527 -0.0064217 0.0610936 0.002549 0.0048963 -0.0058795 0.0056208 0.1686383 -0.0272479 0.0498292 -0.0049223 0.2180807 -0.2419693 0.0132285 -0.0081872 0.0084441 0.1084572 unknown
polarizability: 197.8165829|-20.3404029|102.4258347|4.8954185|-1.8003384|37.6396491 unknown
InChI: InChI=1S/C7H5N3O/c8-10-9-7-3-1-6(5-11)2-4-7/h1-5H
charge 0 multiplicity 1
16 atoms
O  -3.964335 -0.858244 -0.065483
N  2.451639 0.468447 0.090677
N  3.219672 -0.540039 0.130734
N  4.102869 -1.329716 0.169675
C  -1.790657 0.230166 -0.024583
C  1.032175 0.320903 0.053805
C  -1.111797 1.478703 -0.029191
C  -1.036406 -0.97521 0.019895
C  0.291285 1.530762 0.009802
C  0.365007 -0.939058 0.058928
C  -3.271206 0.195576 -0.066316
H  -1.691084 2.409461 -0.063615
H  -1.579208 -1.926874 0.022716
H  0.831769 2.481551 0.006916
H  0.94315 -1.869826 0.092945
H  -3.761873 1.2018 -0.100702
