program: Gaussian 09
title: 000090447
version: EM64L-G09RevD.01
frameworkgroup: C1[X(C16H16O2)]
method: RPBEPBE
basis: SDD
operation: Freq
keyword: #pfreq=noraman
keyword: PBEPBE/SDD
title: #p freq=noraman PBEPBE/SDD
converged: YES YES NO NO
title: Mulliken charges:
elementType: O O C C C C C C C C C C C C C C C C H H H H H H H H H H H H H H H H
charge: -0.252238 -0.263853 -0.375287 0.481054 0.480389 -0.370314 -0.410908 -0.375329 -0.414553 -0.444272 -0.234861 -0.228533 -0.260213 -0.224334 -0.245269 -0.243198 0.313647 -0.752302 0.232348 0.245471 0.248496 0.232066 0.254226 0.264769 0.233109 0.224601 0.226360 0.229946 0.226029 0.228067 0.229250 0.246820 0.254987 0.243827
chargesum: 0.00000
title: Mulliken charges with hydrogens summed into heavy atoms:
elementType: O O C C C C C C C C C C C C C C C C
charge: -0.252238 -0.263853 -0.142939 0.481054 0.480389 0.123653 -0.178842 -0.121103 -0.149784 -0.211163 -0.010260 -0.002173 -0.030267 0.001695 -0.017202 -0.013948 0.313647 -0.006667
polarizability: 2.02798368e+02 -2.05850796e+01 1.56555039e+02 -1.07150649e+01 9.82559777e+00 1.50631759e+02
1716.lowfreq: -12.3223 -7.3066 -3.3509 -0.0004 0.0005 0.0006 20.3793 25.9103 34.7523
frequency: 20.0179 25.7448 34.7216 44.6230 59.9278 62.8266 73.3779 126.0902 164.9669 221.4736 236.9714 251.2665 284.4270 303.4764 403.7400 404.5696 420.7012 455.4221 476.8965 533.2393 562.8154 584.8932 609.8112 616.4201 617.2428 634.8985 706.1200 707.4713 741.1169 763.4190 780.7520 797.0020 855.1027 857.2829 861.1696 920.3190 926.0614 945.0640 978.3866 980.0550 988.0796 990.5610 995.2001 996.5347 997.3575 1001.7698 1026.2021 1031.6483 1043.1421 1061.2181 1081.2118 1107.1456 1172.1572 1173.2238 1185.3029 1189.4441 1193.5864 1202.5026 1212.0467 1221.7357 1240.1166 1318.1139 1328.2731 1353.4021 1357.8786 1379.5474 1383.6809 1386.2586 1438.1541 1441.8441 1452.6613 1454.5456 1480.3497 1481.6443 1489.2142 1591.2242 1593.4644 1609.6161 1615.1168 1649.8985 2993.8603 3007.2110 3027.0610 3094.6676 3098.9484 3112.4438 3114.4025 3124.1147 3124.7779 3135.8441 3136.3074 3142.7650 3145.9921 3146.7881 3162.2493 3163.2851
redmass: 3.8201 3.6039 1.1830 4.6756 3.1507 4.8327 6.1323 4.6222 4.9225 4.6104 4.3272 5.8297 4.6308 2.5757 2.8291 2.8358 3.6093 3.7334 3.5472 3.2379 3.1872 4.0554 4.7383 6.1797 5.9517 4.7477 1.7914 1.7596 2.4759 1.9250 3.2399 3.1590 1.2553 1.2661 3.3864 1.5758 1.5350 3.1538 1.3905 1.4390 3.5538 5.6370 2.0403 1.3496 1.5600 2.0788 2.2900 2.0634 1.6512 2.6509 1.6247 1.9318 1.0692 1.0539 2.4984 1.1316 1.6211 1.5443 2.3181 1.2545 1.5261 1.4062 1.2635 1.3813 1.3298 7.0292 1.2656 5.4449 2.2057 2.1222 1.0594 1.0520 1.9422 1.4099 1.7053 6.0264 5.9061 6.0404 5.9851 8.8388 1.0833 1.0376 1.0571 1.1080 1.0956 1.0875 1.0869 1.0861 1.0860 1.0912 1.0914 1.1017 1.0957 1.0958 1.1015 1.1015
irintensity: 0.0187 0.3566 1.2327 0.3694 1.5243 0.3596 2.5809 2.3265 1.7165 2.1515 2.2696 1.7778 0.0537 9.4129 0.4366 0.0217 4.8276 2.3189 6.5927 30.2092 13.0368 1.4922 1.5223 0.8417 5.0501 12.3122 46.2245 60.9905 33.2460 30.3396 9.0859 20.4402 0.0966 0.4159 4.5396 11.3260 2.5574 56.1587 0.0599 0.2713 1.1827 2.0983 2.8285 0.0246 1.6706 109.8035 2.9046 11.4152 9.1230 17.0970 6.1341 17.2571 0.2372 0.0321 33.5957 9.6252 117.4585 132.0318 39.1420 19.5510 1.6490 3.1274 4.5743 0.4144 2.3620 0.3373 59.3461 0.7028 12.7510 4.4681 22.6255 19.8536 12.5459 37.6481 8.3609 4.1032 0.1032 12.6687 3.1017 151.7506 11.3600 2.0451 27.6484 11.9160 9.6226 8.8164 7.2310 0.6023 0.3951 11.7588 18.1886 9.1594 15.6622 42.5018 30.2576 23.8091
temp: 298.150 k
press: 1.00000 atm
elementType: 8 8 6 6 6 6 6 6 6 6 6 6 6 6 6 6 6 6 1 1 1 1 1 1 1 1 1 1 1 1 1 1 1 1
symmnumber: 1
zpe: 721920.5 jmol-1
zpe.correction: 0.274965 hartree
zpe.thermalcorrener: 0.291591 hartree
zpe.thermalcorrenthalpy: 0.292535 hartree
zpe.thermalcorrgfe: 0.227087 hartree
zpe.sumelectzpe: -768.468591 hartree
zpe.sumelectthermal: -768.451965 hartree
zpe.sumelectthermalent: -768.451021 hartree
zpe.sumelectthermalfe: -768.516468 hartree
dipole: 0.6763 0.1823 -1.7764
dipole: 1.9095
quadrupole: -96.1655 -101.9414 -104.2823
quadrupole: -3.5448 3.9585 5.7022
quadrupole: 4.6309 -1.1450 -3.4859 -3.5448 3.9585 5.7022
hfenergy: -768.7435556 hartree
pointgroup: C01 [X(C16H16O2)]
dipole: 0.2503855 -0.0574969 0.7059576 debye
polarizability: 195.9469093|25.2046218|162.0107405|11.5699317|12.3182101|152.0275174 unknown
InChI: InChI=1S/C16H16O2/c1-13(17)18-12-16(14-8-4-2-5-9-14)15-10-6-3-7-11-15/h2-11,16H,12H2,1H3
charge 0 multiplicity 1
34 atoms
O  -2.075384 1.558525 0.599032
O  -3.002964 1.473502 -1.546457
C  0.121985 0.417046 0.665123
C  -0.37637 -0.985707 0.297688
C  1.601958 0.640295 0.299499
C  -0.692149 1.575248 0.046395
C  -0.057119 -2.061472 1.16703
C  2.135563 0.187481 -0.933738
C  -1.105393 -1.268955 -0.884939
C  2.445731 1.359146 1.1840
C  -0.447928 -3.383665 0.866969
C  3.481004 0.4506 -1.274383
C  -1.50033 -2.593178 -1.18813
C  3.792775 1.621809 0.847301
C  -1.173546 -3.655891 -0.316873
C  4.314742 1.169282 -0.38625
C  -3.14571 1.494873 -0.30262
C  -4.456085 1.434291 0.449562
H  0.03438 0.52767 1.764259
H  -0.256973 2.541658 0.352082
H  -0.737342 1.531517 -1.055617
H  0.50919 -1.858677 2.084965
H  1.503468 -0.390429 -1.617413
H  -1.386424 -0.465261 -1.574539
H  2.046173 1.709675 2.14458
H  -0.190504 -4.19841 1.553335
H  3.880374 0.091259 -2.229632
H  -2.067672 -2.789741 -2.104989
H  4.432953 2.173351 1.545154
H  -1.481907 -4.680473 -0.553407
H  5.35942 1.369011 -0.649793
H  -4.463624 2.159841 1.278981
H  -4.579092 0.426986 0.887075
H  -5.2898 1.630193 -0.24015
