program: Gaussian 09
title: 000090465
version: EM64L-G09RevD.01
frameworkgroup: C1[X(C16H16O4)]
method: RPBEPBE
basis: SDD
operation: Freq
keyword: #pfreq=noraman
keyword: PBEPBE/SDD
title: #p freq=noraman PBEPBE/SDD
converged: YES YES NO NO
title: Mulliken charges:
elementType: O O O O C C C C C C C C C C C C C C C C H H H H H H H H H H H H H H H H
charge: -0.291354 -0.265294 -0.259355 -0.272027 0.489696 -0.438511 -0.351143 -0.413486 0.215604 0.325081 -0.350227 -0.353558 0.197865 -0.350060 -0.313837 0.333789 -0.345456 -0.342210 -0.538015 -0.537538 0.224897 0.241538 0.239390 0.231187 0.251106 0.240951 0.267627 0.276871 0.244400 0.253878 0.246219 0.222111 0.221504 0.225231 0.225159 0.247967
chargesum: 0.00000
title: Mulliken charges with hydrogens summed into heavy atoms:
elementType: O O O O C C C C C C C C C C C C C C C C
charge: -0.291354 -0.265294 -0.259355 -0.272027 0.489696 0.027924 -0.111753 -0.182299 0.215604 0.325081 -0.099121 -0.112607 0.197865 -0.082433 -0.036966 0.333789 -0.101056 -0.088332 0.151818 0.160819
polarizability: 2.98466940e+02 9.29064492e+00 1.74831851e+02 1.29802709e+01 1.48726522e+00 1.27709142e+02
1716.lowfreq: -5.5616 -1.8652 -0.0006 -0.0004 0.0004 5.8075 6.5079 14.6028 25.4272
frequency: -0.8173 14.3937 25.3453 48.4122 78.2725 82.1130 111.9814 119.4049 154.2606 170.3430 197.4831 219.9433 224.2479 238.0488 256.1339 309.8562 312.9981 326.6483 360.2899 413.8242 418.0613 429.5631 454.3939 502.8731 506.5647 511.7994 557.1673 585.5283 627.6741 632.5049 676.1351 705.7167 726.7582 754.1812 761.6915 802.3970 810.6967 825.2728 826.7784 851.3318 856.5403 877.6735 937.8031 962.2875 969.7835 975.3128 983.1170 987.5879 988.2976 998.2213 1003.9406 1047.6638 1111.7079 1111.9297 1112.5234 1115.6482 1155.2836 1156.3107 1169.9719 1179.4657 1198.5105 1226.7183 1232.9895 1236.8684 1247.7104 1298.8854 1304.9451 1351.0413 1380.3987 1388.3620 1420.1687 1427.4715 1436.4191 1436.7059 1466.8064 1467.7396 1471.5791 1472.7759 1475.9301 1497.5028 1506.7724 1573.3196 1586.0631 1610.1927 1621.2349 1626.6747 2960.0772 2965.6096 3010.8495 3048.2370 3056.2859 3073.9633 3125.0106 3126.6106 3130.0135 3134.0125 3148.7630 3160.6661 3163.0393 3169.1877 3169.4912 3182.4430
redmass: 4.3925 3.6245 5.7346 4.3543 4.1387 5.0592 4.2530 4.6257 4.5078 4.2459 3.1952 2.0382 1.1936 2.1843 2.7718 4.7563 5.1750 2.8172 5.9324 2.9559 2.9780 4.6564 4.7850 3.8169 2.9774 4.1937 3.2695 6.3058 7.0829 6.7185 4.1979 4.7200 4.1890 4.5764 5.5904 5.8734 1.5936 1.3003 1.5747 1.6540 3.4240 6.0204 1.4101 1.4959 1.5790 1.3597 8.2525 1.3488 7.8607 3.2854 2.6227 4.2602 1.2855 1.2607 1.2936 1.3116 1.3269 1.3314 1.2510 1.2257 1.0989 2.0646 3.0582 4.3349 3.4521 1.2898 1.2898 1.6052 5.4157 4.4759 3.5515 4.0747 1.1965 1.1722 1.0507 1.0505 1.0789 1.0695 1.0963 2.4965 2.6482 7.9385 7.0586 10.1262 6.6685 6.4732 1.0330 1.0327 1.0576 1.1040 1.1042 1.1072 1.0926 1.0962 1.0998 1.0895 1.0880 1.0886 1.0940 1.0959 1.0957 1.0972
irintensity: 0.0580 1.0609 0.4422 3.0981 1.2848 0.0899 3.4067 5.3073 4.9957 3.8073 9.5977 6.9123 0.4149 4.1195 1.0347 1.3087 1.6888 1.8928 0.3336 1.2564 0.0543 9.8302 1.6729 6.7417 9.7757 32.5201 21.7486 22.1381 3.9138 0.8023 26.0116 4.9547 0.5903 14.3659 4.2746 9.8194 48.2529 8.0829 31.3014 57.2684 76.4848 63.4715 0.4945 1.6166 2.0622 1.0707 88.6988 0.1480 44.5470 89.0490 2.1904 479.9844 4.1980 0.3873 5.6733 12.0463 5.8852 1.2763 286.6593 34.5205 3.2949 67.1232 31.7152 284.4781 435.1002 3.7787 1.9453 26.1195 29.8948 10.5904 5.0501 0.9696 9.2412 8.1061 13.7118 15.0076 61.4705 43.1204 8.6378 57.3873 90.6729 5.4307 14.6851 307.7625 164.5329 67.0124 71.4627 70.8781 25.7717 48.3810 44.0422 12.8436 34.4168 5.1467 23.3372 11.9604 1.6849 2.2783 16.0306 4.5960 13.6222 3.4206
temp: 298.150 k
press: 1.00000 atm
elementType: 8 8 8 8 6 6 6 6 6 6 6 6 6 6 6 6 6 6 6 6 1 1 1 1 1 1 1 1 1 1 1 1 1 1 1 1
symmnumber: 1
zpe: 741207.4 jmol-1
zpe.correction: 0.282311 hartree
zpe.thermalcorrener: 0.300327 hartree
zpe.thermalcorrenthalpy: 0.301271 hartree
zpe.thermalcorrgfe: 0.234026 hartree
zpe.sumelectzpe: -918.729856 hartree
zpe.sumelectthermal: -918.711839 hartree
zpe.sumelectthermalent: -918.710895 hartree
zpe.sumelectthermalfe: -918.778141 hartree
dipole: 0.2885 -1.7878 -1.3786
dipole: 2.2760
quadrupole: -66.6418 -124.4107 -113.6833
quadrupole: 2.4589 13.5950 0.6762
quadrupole: 34.9368 -22.8321 -12.1047 2.4589 13.5950 0.6762
hfenergy: -919.0121667 hartree
pointgroup: C01 [X(C16H16O4)]
dipole: -0.1280989 -0.7372089 0.4918725 debye
polarizability: 297.7850546|-11.0330356|174.9687121|15.5889761|1.3671194|128.2541663 unknown
InChI: InChI=1S/C16H16O4/c1-18-14-7-3-12(4-8-14)11-20-16(17)13-5-9-15(19-2)10-6-13/h3-10H,11H2,1-2H3
charge 0 multiplicity 1
36 atoms
O  0.022708 0.933026 0.417291
O  5.83005 -1.504265 -0.584655
O  -5.640738 -1.953472 -0.080399
O  -1.2462 2.852621 0.004205
C  2.45579 0.928322 0.246727
C  1.252308 1.797893 0.495676
C  2.774106 0.491456 -1.068501
C  3.299688 0.531429 1.308845
C  -2.334987 0.670647 0.09819
C  4.733709 -0.703382 -0.232877
C  3.896206 -0.316929 -1.311868
C  4.436909 -0.277996 1.085348
C  -1.181574 1.604716 0.160421
C  -3.623111 1.208274 -0.146594
C  -2.189833 -0.733973 0.276042
C  -4.596033 -1.025915 -0.035664
C  -4.755165 0.373626 -0.215448
C  -3.309469 -1.575878 0.209485
C  6.731984 -1.928454 0.488976
C  -6.99609 -1.448877 -0.326448
H  1.270285 2.252232 1.502469
H  1.136677 2.605447 -0.249098
H  2.130524 0.786611 -1.905498
H  3.068797 0.855492 2.330997
H  4.15022 -0.658378 -2.319799
H  5.070246 -0.564893 1.929852
H  -3.718681 2.290898 -0.281497
H  -1.195005 -1.146576 0.464141
H  -5.738895 0.812267 -0.405863
H  -3.220628 -2.658055 0.342465
H  7.506703 -2.530009 -0.008421
H  6.202531 -2.548244 1.238649
H  7.199321 -1.058274 0.989836
H  -7.065172 -0.949851 -1.312069
H  -7.313554 -0.748657 0.469878
H  -7.638829 -2.34088 -0.315396
