program: Gaussian 09
title: 000090454
version: EM64L-G09RevD.01
frameworkgroup: C1[X(C19H22N2O)]
method: RPBEPBE
basis: SDD
operation: Freq
keyword: #p
keyword: freq=noraman
keyword: PBEPBE/SDD
title: #p freq=noraman PBEPBE/SDD
converged: NO YES NO NO
title: Mulliken charges:
elementType: O N N C C C C C C C C C C C C C C C C C C C H H H H H H H H H H H H H H H H H H H H H H
charge: -0.449120 -0.021931 -0.022248 -0.121696 -0.058670 -0.530137 -0.122478 -0.484616 -0.535204 -0.460027 -0.333120 -0.071191 0.414684 0.225174 -0.630885 -0.341563 -0.064183 -0.348941 -0.384873 -0.311836 -0.276957 -0.227192 0.223332 0.265734 0.237405 0.228431 0.209287 0.217727 0.215813 0.233724 0.216903 0.231836 0.233676 0.210270 0.224664 0.349040 0.215243 0.217431 0.263276 0.205968 0.236208 0.261224 0.228423 0.231391
chargesum: 0.00000
title: Mulliken charges with hydrogens summed into heavy atoms:
elementType: O N N C C C C C C C C C C C C C C C C C C C
charge: -0.100080 -0.021931 -0.022248 0.101636 0.207064 -0.064300 0.086809 -0.051076 -0.084576 0.005486 -0.122850 0.153473 0.414684 0.225174 -0.198210 -0.078287 -0.064183 -0.142973 -0.148665 -0.050612 -0.048534 0.004199
polarizability: 2.55800013e+02 7.27727903e+00 2.47424672e+02 -2.29445999e+01 -2.04752320e+00 1.51301773e+02
1716.lowfreq: -9.1254 -1.0442 -0.0007 -0.0003 0.0001 7.7815 16.4183 38.2549 40.5128
frequency: 14.7123 38.2222 40.4446 61.3445 82.0456 123.4783 159.5396 170.3453 181.0528 202.9515 224.8850 245.4602 263.9892 288.6061 327.1082 328.9561 340.1293 366.3100 372.7619 414.9102 424.2596 453.0849 472.2725 492.1236 512.6709 526.4630 556.6335 570.5625 591.5639 604.9632 630.4341 658.5489 661.8058 742.1964 751.6255 766.7430 790.9068 799.2460 807.5747 808.9354 833.9691 849.4207 851.4102 868.6849 882.3449 912.2239 924.5800 937.0972 943.8572 956.3091 962.1882 967.0173 973.1657 996.1031 1001.5833 1003.0747 1013.8214 1017.6881 1025.8539 1040.8841 1054.0944 1069.1584 1077.1046 1083.6576 1118.3470 1138.7821 1142.1777 1161.2993 1174.2290 1191.9478 1199.5126 1219.2339 1227.6570 1239.7468 1249.7915 1253.9341 1255.5106 1284.9030 1287.9400 1292.1948 1302.1390 1307.7336 1308.9415 1314.1173 1319.4856 1329.7879 1337.1647 1341.1977 1345.4051 1372.9578 1379.4374 1384.2439 1429.5878 1431.1619 1452.0705 1458.9183 1465.1000 1469.0614 1476.9672 1509.6167 1552.8278 1578.9343 1622.4359 1649.5992 2976.2939 2980.1611 2982.9632 2999.6260 3003.0043 3005.5208 3006.9629 3035.2345 3040.1747 3059.9483 3063.1430 3069.8831 3071.0216 3086.6432 3120.0602 3130.8446 3146.2079 3156.4205 3163.0961 3172.8515 3191.1897 3560.5503
redmass: 4.5321 4.9526 4.2839 4.3905 2.6931 4.3463 3.1912 4.5963 4.5987 3.4203 3.0035 2.2764 2.2168 3.5062 1.3011 2.0866 2.1901 3.1833 3.7236 3.4561 3.0895 3.3495 3.2514 4.4172 5.7405 6.4300 4.2245 3.1206 4.2915 4.8822 6.1117 2.2283 2.5266 4.9372 2.2755 1.4376 2.5294 2.2897 2.5181 5.4277 2.7318 2.0785 2.9496 1.3783 1.7621 2.7568 2.3731 1.3526 2.0432 5.2275 1.3832 1.5992 1.7962 1.3302 1.8621 1.2290 3.0749 3.4039 2.1437 2.3251 2.3913 3.0646 2.4404 2.5767 2.0010 1.1175 1.3560 1.7623 1.1980 1.2280 1.4653 1.9333 1.5318 1.7774 1.5458 1.5750 1.5060 1.2735 1.3442 1.2452 1.4812 1.3623 1.3731 1.4395 1.3520 1.3917 1.4359 1.4015 2.0591 1.3999 3.2489 1.8117 1.2083 2.8547 2.6902 1.0813 1.0842 1.0814 1.0892 3.8139 6.7671 6.6759 6.4623 4.6682 1.0814 1.0831 1.0606 1.0601 1.0616 1.0858 1.0625 1.0928 1.0980 1.1028 1.0881 1.0970 1.1048 1.0707 1.0892 1.0855 1.0893 1.0945 1.0944 1.0996 1.1142 1.0661
irintensity: 0.2743 0.1532 0.1953 0.2837 0.2785 1.0479 0.2558 0.7416 6.5189 1.6702 0.7326 1.7388 0.0954 7.8812 116.3061 10.1651 8.6711 1.1759 7.4455 7.1708 0.3633 9.4971 0.0647 4.5327 5.9783 0.5687 3.8998 4.9399 2.2795 6.9595 4.6850 8.4649 6.0949 2.7558 22.7741 60.6191 9.6135 22.2655 27.2336 2.1699 4.2994 15.1035 2.9137 13.5779 12.4180 10.2945 19.5370 65.0632 5.0653 49.8099 2.5213 2.6728 11.2822 0.4283 3.2368 10.2605 14.0483 7.0534 17.8532 7.9521 21.8791 3.8431 6.4153 26.1770 14.8042 2.1868 4.6990 8.0567 1.1874 2.8183 10.9137 0.5769 5.9029 8.0690 11.1913 13.6046 5.5726 2.4976 11.1555 0.9386 9.6644 6.0807 5.8973 1.3025 1.4864 11.2747 0.3863 4.8845 7.0498 3.0912 0.1245 12.5911 4.8223 9.1262 1.9044 6.9121 4.6852 18.3858 5.6874 25.8050 12.6223 18.3722 2.8101 32.0177 14.8907 26.4600 28.5992 51.3012 60.1275 25.9611 19.6697 27.0540 26.5839 8.7057 16.6684 49.5466 76.8452 6.5621 26.7535 1.6907 13.3214 11.7688 27.6416 19.8566 26.3560 9.2693
temp: 298.150 k
press: 1.00000 atm
elementType: 8 7 7 6 6 6 6 6 6 6 6 6 6 6 6 6 6 6 6 6 6 6 1 1 1 1 1 1 1 1 1 1 1 1 1 1 1 1 1 1 1 1 1 1
symmnumber: 1
zpe: 967258.9 jmol-1
zpe.correction: 0.368409 hartree
zpe.thermalcorrener: 0.387152 hartree
zpe.thermalcorrenthalpy: 0.388097 hartree
zpe.thermalcorrgfe: 0.320569 hartree
zpe.sumelectzpe: -920.295000 hartree
zpe.sumelectthermal: -920.276257 hartree
zpe.sumelectthermalent: -920.275313 hartree
zpe.sumelectthermalfe: -920.342840 hartree
dipole: 2.3669 0.8202 -0.5565
dipole: 2.5660
quadrupole: -140.4191 -122.0201 -128.3730
quadrupole: -3.2589 6.8906 -0.7721
quadrupole: -10.1483 8.2506 1.8977 -3.2589 6.8906 -0.7721
hfenergy: -920.6634092 hartree
pointgroup: C01 [X(C19H22N2O1)]
dipole: -0.8991226 -0.4287251 -0.1642477 debye
polarizability: 253.1326474|12.8850811|245.9562342|24.0143963|-15.7348902|155.4375762 unknown
InChI: InChI=1S/C19H22N2O/c1-2-13-12-21-10-8-14(13)11-18(21)19(22)16-7-9-20-17-6-4-3-5-15(16)17/h2-7,9,13-14,18-19,22H,1,8,10-12H2
charge 0 multiplicity 1
44 atoms
O  -0.257073 1.384488 -2.525556
N  -1.211666 0.226548 0.913564
N  3.964859 1.481083 0.295985
C  -3.635962 0.605118 0.056232
C  -1.184689 1.038903 -0.347193
C  -2.599658 1.042119 -1.018135
C  -3.441438 -0.910575 0.396741
C  -3.394809 1.415809 1.361875
C  -1.896322 -1.084299 0.694708
C  -1.987648 1.002691 1.934622
C  -0.049724 0.580831 -1.298544
C  -3.914671 -1.849068 -0.686987
C  1.342414 0.831875 -0.722131
C  2.178611 -0.208155 -0.171668
C  -4.830094 -2.837872 -0.523138
C  1.846959 2.139869 -0.740261
C  3.493584 0.172531 0.319873
C  1.801158 -1.589909 -0.086634
C  3.146635 2.417911 -0.220499
C  4.365766 -0.825981 0.861289
C  2.673628 -2.543385 0.442055
C  3.967147 -2.161875 0.920303
H  -4.661878 0.77495 -0.316327
H  -0.929182 2.071738 -0.041289
H  -2.625481 0.365378 -1.891644
H  -2.835164 2.049508 -1.402385
H  -4.018717 -1.128149 1.318086
H  -4.196025 1.208204 2.0960
H  -3.426478 2.499155 1.136972
H  -1.744511 -1.709576 1.592258
H  -1.408548 -1.606213 -0.148343
H  -1.395193 1.888323 2.225362
H  -2.091805 0.364069 2.830583
H  -0.179768 -0.491733 -1.548446
H  -3.456728 -1.71406 -1.680794
H  0.504219 1.224731 -3.13947
H  -5.123095 -3.495651 -1.349275
H  -5.315128 -3.016723 0.445213
H  1.24488 2.949961 -1.163745
H  0.811692 -1.906888 -0.428399
H  3.533574 3.44422 -0.230952
H  5.344571 -0.493286 1.220089
H  2.36521 -3.593316 0.496121
H  4.639649 -2.921301 1.333981
