program: Gaussian 09
title: 000090475
version: EM64L-G09RevD.01
frameworkgroup: C1[X(C13H17Cl2N2O3S)]
method: RPBEPBE
basis: SDD
operation: Freq
keyword: #p
keyword: freq=noraman
keyword: PBEPBE/SDD
title: #p freq=noraman PBEPBE/SDD
converged: YES YES NO NO
title: Mulliken charges:
elementType: Cl Cl S O O O N N C C C C C C C C C C C C C H H H H H H H H H H H H H H H H H
charge: 0.070588 0.073074 1.052027 -0.594894 -0.526167 -0.461008 -0.187167 -0.196585 0.386520 -0.437989 0.289589 0.280931 -0.386405 -0.389985 -0.593605 -0.797191 -0.292487 -0.291829 -0.633278 -0.110368 -0.113491 0.261544 0.312045 0.280217 0.268219 0.254304 0.250695 0.325821 0.313736 0.265561 0.279911 0.337135 0.283442 0.289626 0.233045 0.260229 0.240441 0.403748
chargesum: 1.00000
title: Mulliken charges with hydrogens summed into heavy atoms:
elementType: Cl Cl S O O O N N C C C C C C C C C C C C C
charge: 0.070588 0.073074 1.052027 -0.191146 -0.526167 -0.461008 -0.187167 -0.196585 0.386520 0.135600 0.289589 0.280931 0.162031 0.115013 0.045953 0.085417 -0.009044 -0.002202 0.100437 -0.110368 -0.113491
polarizability: 2.96783062e+02 1.96723849e+01 2.24707744e+02 1.46312984e+01 2.16035312e+00 1.24566231e+02
1716.lowfreq: -5.3677 -0.0011 0.0013 0.0020 2.8869 7.2481 17.5684 31.9658 45.1627
frequency: 17.5573 31.9474 45.1500 55.9913 59.3002 67.0058 82.0226 104.8030 137.8423 147.2271 162.9986 176.5314 190.5783 194.5304 207.1831 217.4055 225.4714 252.0559 270.7375 284.7351 291.6895 307.0892 319.4227 326.7503 328.5129 339.3888 373.1789 388.0569 421.9064 430.9728 434.6170 478.3262 494.1808 544.7485 585.6374 606.2586 621.6269 646.7798 658.0436 677.6712 705.1501 737.0263 766.7871 791.0671 819.3419 843.1364 858.0189 864.2044 865.3830 902.4234 953.8152 959.4042 994.5151 1006.1862 1033.1328 1044.9313 1047.8038 1057.1912 1086.0267 1092.7817 1096.7100 1144.5662 1155.9647 1192.2046 1212.2465 1234.0521 1239.4134 1274.4510 1294.1050 1312.2447 1326.5097 1344.3622 1353.8967 1387.0198 1394.8681 1405.1570 1413.1887 1418.2687 1425.2322 1442.7287 1446.9513 1456.2530 1466.2047 1472.0350 1480.1989 1483.2968 1504.5737 1513.6471 1520.6910 1600.4080 1627.0682 2965.3161 3001.9744 3002.9916 3033.0045 3040.9834 3044.6927 3053.2625 3061.3289 3088.3570 3097.3104 3106.4152 3112.3533 3119.8998 3151.8777 3178.1999 3182.8442 3490.4949
redmass: 5.9572 8.8750 5.1887 6.2769 4.0592 4.9058 7.3744 3.9792 3.2849 1.2821 4.6375 3.5588 15.8307 4.3125 3.5273 1.3565 2.1393 4.2770 5.1297 2.5733 7.2723 3.1641 2.0207 3.3391 3.1988 3.6908 4.1632 5.0899 4.8002 2.9656 7.1130 5.5621 5.9403 7.5090 3.8676 3.0855 6.1564 5.9705 5.6506 5.6378 4.5618 4.0016 1.3192 1.2471 3.5842 3.7392 1.5609 2.9010 1.4444 2.8052 3.4474 3.6502 1.9390 2.1136 1.9612 1.4314 1.6109 2.1124 2.1565 1.9450 2.4648 1.9339 1.3815 2.1078 3.0710 1.3720 1.5821 1.3304 1.3384 1.4041 2.3362 1.3513 1.4289 7.3506 1.6618 1.2201 2.5245 1.1032 1.1826 1.6033 1.1490 3.5822 1.1677 1.0546 1.0775 1.3402 1.7243 1.1414 2.5305 10.0728 8.3372 1.0448 1.0366 1.0613 1.0632 1.0622 1.0959 1.0749 1.0810 1.1019 1.1049 1.1000 1.1028 1.0947 1.1113 1.0940 1.0942 1.0667
irintensity: 4.0210 1.0470 2.2752 0.3932 1.7151 1.0037 5.7420 2.9250 0.1217 0.6587 0.9205 0.1586 0.0952 6.5177 2.2774 1.0307 13.3877 0.2792 12.0696 2.0030 14.3924 32.4406 66.8993 20.1044 24.7224 9.0255 1.9256 6.7641 10.2683 9.6444 1.5518 8.7958 27.3420 91.9532 7.9717 2.1671 22.1446 1.7312 0.7622 1.7607 2.3189 0.0814 25.0887 4.5191 16.0221 48.8494 5.4668 27.7325 39.3807 16.4268 18.0550 126.8716 10.2847 5.0918 18.8792 84.9917 8.5143 9.2486 16.2989 15.5471 41.0178 5.6002 8.4789 10.7624 5.5610 4.5705 0.6138 3.9458 4.3273 5.9374 8.6388 21.5002 12.5867 26.4019 56.8593 17.9449 76.8808 14.2785 26.6893 53.4937 4.2906 130.0177 40.6493 14.3046 3.6517 3.3295 42.6020 11.0266 30.2484 20.9331 2.6783 81.4319 5.3381 4.8093 5.3026 12.3921 36.7816 1.5925 0.7290 1.4343 5.7832 14.2319 13.6010 7.8060 0.8665 0.7981 1.2392 76.6742
temp: 298.150 k
press: 1.00000 atm
elementType: 17 17 16 8 8 8 7 7 6 6 6 6 6 6 6 6 6 6 6 6 6 1 1 1 1 1 1 1 1 1 1 1 1 1 1 1 1 1
symmnumber: 1
zpe: 753671.8 jmol-1
zpe.correction: 0.287058 hartree
zpe.thermalcorrener: 0.309913 hartree
zpe.thermalcorrenthalpy: 0.310857 hartree
zpe.thermalcorrgfe: 0.233250 hartree
zpe.sumelectzpe: -2156.977297 hartree
zpe.sumelectthermal: -2156.954442 hartree
zpe.sumelectthermalent: -2156.953498 hartree
zpe.sumelectthermalfe: -2157.031106 hartree
dipole: 0.4822 3.8428 2.2768
dipole: 4.4926
quadrupole: -131.8218 -104.1462 -139.2807
quadrupole: -15.1544 12.4656 4.6735
quadrupole: -6.7389 20.9367 -14.1978 -15.1544 12.4656 4.6735
hfenergy: -2157.2643553 hartree
pointgroup: C01 [X(C13H17Cl2N2O3S1)]
dipole: -0.254549 -1.6681262 -0.5259889 debye
polarizability: 280.2811955|-38.6303115|237.3639855|-11.541349|-18.1957302|128.4118559 unknown
InChI: InChI=1S/C13H17Cl2N2O3S/c1-3-16-9(2)17(5-4-6-21(18,19)20)13-8-11(15)10(14)7-12(13)16/h7-8,18H,3-6H2,1-2H3
charge 1 multiplicity 1
38 atoms
Cl -3.054401 3.842387 -0.956735
Cl -5.385919 1.754784 -0.072445
S  4.5862 -0.619681 0.082667
O  4.370689 -0.936722 -1.749601
O  3.673692 -1.714265 0.861106
O  6.144318 -0.444432 0.440266
N  0.138826 -0.411618 -0.69512
N  -1.464404 -1.847119 -0.104098
C  -0.123994 -1.725724 -0.376601
C  1.468644 0.150481 -1.023898
C  -1.059213 0.3339 -0.609931
C  -2.079109 -0.579061 -0.230306
C  2.132889 0.804281 0.217531
C  -2.179157 -3.08754 0.306293
C  3.621896 1.08063 0.031327
C  0.884382 -2.822745 -0.356006
C  -1.334357 1.6938 -0.839462
C  -3.412475 -0.166681 -0.058983
C  -2.279792 -3.22985 1.837009
C  -2.668549 2.112081 -0.671184
C  -3.693765 1.194623 -0.284469
H  1.332829 0.887136 -1.835142
H  2.1016 -0.654903 -1.430287
H  1.994185 0.152549 1.100147
H  1.64582 1.770034 0.45344
H  -3.180442 -3.048438 -0.155944
H  -1.657212 -3.948683 -0.141157
H  4.069731 1.638481 0.869251
H  3.922357 1.499601 -0.940758
H  0.509443 -3.698764 0.193678
H  1.133996 -3.149373 -1.383753
H  1.827523 -2.499108 0.125121
H  -0.570262 2.414385 -1.141009
H  -4.213552 -0.848663 0.235487
H  -1.28326 -3.310676 2.30477
H  -2.843919 -4.146195 2.081193
H  -2.808567 -2.375153 2.292451
H  5.088329 -1.562658 -2.057047
