program: Gaussian 09
title: 000090377
version: EM64L-G09RevD.01
frameworkgroup: C1[X(C8H6Br2)]
method: RPBEPBE
basis: SDD
operation: Freq
keyword: #pfreq=noraman
keyword: PBEPBE/SDD
title: #p freq=noraman PBEPBE/SDD
converged: YES YES NO NO
title: Mulliken charges:
elementType: Br Br C C C C C C C C H H H H H H
charge: 0.020299 0.030952 0.563551 -0.374482 -0.366728 -0.155860 -0.193737 -0.212597 -0.177758 -0.561071 0.234282 0.275052 0.254399 0.228867 0.222907 0.211923
chargesum: 0.00000
title: Mulliken charges with hydrogens summed into heavy atoms:
elementType: Br Br C C C C C C C C
charge: 0.020299 0.030952 0.563551 -0.374482 -0.132446 0.119192 0.060662 -0.212597 0.051110 -0.126241
polarizability: 1.90837710e+02 -1.82836632e+01 1.39742664e+02 -4.74665174e-02 1.25598288e-01 4.05951219e+01
1716.lowfreq: -5.1622 -4.7219 -0.0003 0.0002 0.0003 0.8779 21.5586 91.3810 124.7279
frequency: 20.7742 91.3780 124.7271 141.1697 168.8672 254.2644 283.1915 308.1902 332.8794 423.2719 512.2096 523.1430 602.9822 635.9509 656.5812 754.9172 784.2839 833.2491 880.0654 940.5070 961.9252 1004.9151 1018.6971 1030.1628 1081.9370 1140.7255 1213.4059 1268.8029 1309.6630 1349.0508 1376.1408 1432.3978 1454.2101 1545.9275 1580.9301 1641.0899 3104.9931 3131.4605 3150.3406 3175.6536 3185.0517 3208.8613
redmass: 2.4118 3.3843 22.0982 5.2534 5.0845 12.5015 3.4904 8.6875 3.9832 2.6450 4.2076 4.2660 4.4040 2.0937 6.8961 2.2046 4.8605 1.6325 1.4199 1.3393 1.3715 4.7180 1.1591 1.6708 2.2531 1.5981 1.8062 1.4640 1.4349 2.8512 4.7220 1.4753 1.9717 6.8991 6.8755 4.2029 1.0608 1.0917 1.0878 1.0966 1.0934 1.1135
irintensity: 0.1475 0.1231 0.0081 0.4777 0.3538 2.4986 1.7931 2.5830 4.7583 15.0513 3.0783 4.6820 16.1197 2.2929 21.9780 0.2770 38.7177 40.1022 15.6761 78.1766 5.7252 57.4698 17.4059 1.2564 39.0078 2.6363 5.7157 0.0179 3.2940 17.7680 12.2698 35.2812 86.2113 17.1763 61.5119 10.1366 6.0759 8.7771 4.0728 4.3010 0.2034 18.2856
temp: 298.150 k
press: 1.00000 atm
elementType: 35 35 6 6 6 6 6 6 6 6 1 1 1 1 1 1
symmnumber: 1
zpe: 290925.5 jmol-1
zpe.correction: 0.110808 hartree
zpe.thermalcorrener: 0.120724 hartree
zpe.thermalcorrenthalpy: 0.121668 hartree
zpe.thermalcorrgfe: 0.072037 hartree
zpe.sumelectzpe: -334.639533 hartree
zpe.sumelectthermal: -334.629616 hartree
zpe.sumelectthermalent: -334.628672 hartree
zpe.sumelectthermalfe: -334.678303 hartree
dipole: -0.6543 1.9619 -0.0041
dipole: 2.0682
quadrupole: -75.3569 -67.8261 -82.1877
quadrupole: -2.0196 0.0251 0.0266
quadrupole: -0.2333 7.2975 -7.0641 -2.0196 0.0251 0.0266
hfenergy: -334.7503403 hartree
pointgroup: C01 [X(C8H6Br2)]
dipole: -0.451891 0.6602918 -0.1479239 debye
dipolederiv: -0.1995992 -0.2582747 0.0594804 -0.2783807 -0.5333768 0.1168425 0.0640987 0.1165424 -0.0540693 -0.8316002 -0.0051273 0.0057742 0.0215519 -0.0627957 0.0093911 -0.0005189 0.0095363 -0.0233284 0.0416905 -0.2623501 0.0583755 -0.1948861 -0.3208514 0.0948767 0.0393618 0.097309 0.0771916 0.3184391 0.5522532 -0.1276481 0.4117422 0.9597695 -0.2548739 -0.0973539 -0.2557816 -0.092982 0.0397112 0.097309 -0.0218386 0.034892 0.0441244 -0.0411927 -0.0063568 -0.0409245 -0.1206523 -0.5377274 -0.2233387 0.0538164 -0.2430414 -0.2221214 0.045858 0.0589662 0.0450603 -0.0381073 -0.4397291 0.1019979 -0.0214839 0.087929 -0.0212712 -0.017249 -0.0187284 -0.0170235 -0.0889815 1.3712819 -0.0096164 -0.0057134 -0.0091458 0.1182887 -0.0570357 -0.0059265 -0.0574143 -0.1193314 0.282229 -0.0735925 0.0144695 0.1975153 0.0189727 -0.0305621 -0.0409282 -0.0320424 -0.1255622 -0.1656916 0.1623699 -0.0340624 0.1601227 -0.0114144 -0.0764542 -0.0335559 -0.0778839 -0.3683677 0.0178221 0.0685089 -0.0155877 0.0406598 -0.040759 0.0431873 -0.0092585 0.0424852 0.1372176 0.0784406 0.0418374 -0.0090671 0.048107 0.0284693 0.030101 -0.0105878 0.030353 0.1546484 0.0484494 -0.0675805 0.0160529 -0.0693432 0.0069815 0.0363974 0.0162721 0.0367092 0.1558927 0.0251149 -0.0214904 0.0050522 -0.1168599 0.0053089 0.030775 0.0255478 0.0317562 0.1494829 -0.1033983 0.0077198 -0.0009633 -0.01623 0.0837791 0.0212273 0.0034981 0.0221425 0.1822537 0.054567 -0.1106253 0.0233433 -0.0746328 -0.0531042 0.0487113 0.0154702 0.0491759 0.1746952 unknown
polarizability: 196.5796246|-2.9008824|129.5165851|-0.4075864|-19.9528077|45.0792857 unknown
InChI: InChI=1S/C8H6Br2/c1-2-6-3-4-7(9)5-8(6)10/h2-5H,1H2
charge 0 multiplicity 1
16 atoms
Br -1.141624 -2.720721 0.656372
Br 3.883605 0.01653 0.007586
C  -0.930144 0.173343 -0.003663
C  -0.210777 -1.027347 0.265758
C  -0.135864 1.328615 -0.271546
C  1.198861 -1.090237 0.273444
C  1.269537 1.302944 -0.27256
C  1.926443 0.084283 0.002201
C  -2.406613 0.224946 -0.008363
C  -3.183793 1.320503 -0.232015
H  -0.641124 2.275257 -0.487139
H  1.711743 -2.03059 0.485809
H  1.842634 2.2099 -0.482871
H  -2.910365 -0.72818 0.192377
H  -4.275135 1.240212 -0.211805
H  -2.777384 2.317543 -0.437584
