program: Gaussian 09
title: 000090388
version: EM64L-G09RevD.01
frameworkgroup: C1[X(C6H12N2O3)]
method: RPBEPBE
basis: SDD
operation: Freq
keyword: #p
keyword: freq=noraman
keyword: PBEPBE/SDD
title: #p freq=noraman PBEPBE/SDD
converged: YES YES NO NO
title: Mulliken charges:
elementType: O O O N N C C C C C C H H H H H H H H H H H H
charge: -0.262406 -0.285851 -0.260280 -0.547729 -0.610650 -0.235674 -0.503090 0.269582 0.182777 -0.228723 -0.669978 0.277155 0.267712 0.218639 0.275287 0.291808 0.231076 0.228269 0.215094 0.228174 0.235086 0.357971 0.325752
chargesum: 0.00000
title: Mulliken charges with hydrogens summed into heavy atoms:
elementType: O O O N N C C C C C C
charge: -0.262406 -0.285851 -0.260280 0.019366 0.073073 0.041481 -0.016740 0.269582 0.182777 0.230622 0.008376
polarizability: 1.02118599e+02 2.33082050e+00 8.96695698e+01 -1.29969906e+00 -4.54812733e+00 7.66066105e+01
1716.lowfreq: -8.4255 -4.1868 -2.1816 -0.0009 -0.0003 0.0008 24.0354 46.5430 62.7042
frequency: 23.8294 46.5377 62.6979 104.0256 110.3743 134.5303 165.8778 234.4810 260.9611 272.0276 285.7701 332.1290 358.1372 408.5696 445.9809 542.4058 575.2374 594.0091 612.7957 651.7009 702.4280 738.1383 797.9974 799.7989 852.9049 873.6837 951.0713 995.5592 1023.2685 1083.5142 1098.6792 1112.8832 1134.4261 1137.2584 1140.0943 1208.2591 1248.6557 1300.3059 1317.1770 1353.9195 1355.3412 1363.0946 1402.3158 1452.0756 1463.7019 1473.5081 1485.9584 1585.3774 1615.1530 1633.1465 1643.6706 2997.6917 3009.5796 3012.0404 3050.8040 3071.2290 3094.3210 3109.5473 3109.9655 3457.3109 3468.6858 3592.1732 3641.0134
redmass: 4.1390 3.6081 4.6342 3.9003 2.9337 2.9685 4.8461 1.3929 4.3526 1.9814 1.4167 4.2265 3.1671 2.8090 2.5722 2.6784 1.5156 1.3874 3.3505 1.2139 2.9422 5.9123 1.1770 3.0172 4.7861 3.4545 1.8751 2.4245 2.3879 1.8612 2.7741 2.2914 1.5178 1.7115 2.1695 1.4575 1.1369 1.3958 1.6639 1.3721 1.9420 1.7140 1.2621 1.0987 1.0399 1.0626 1.0686 2.1907 2.4848 1.1010 4.2645 1.0359 1.0648 1.0582 1.0845 1.1067 1.0985 1.1026 1.0983 1.0445 1.0476 1.0989 1.1025
irintensity: 1.8256 3.9512 2.4339 2.4173 4.9097 0.8058 6.3094 1.2548 7.5968 12.9174 54.0205 15.4227 4.7394 4.7018 11.4368 33.9831 155.9252 218.3790 49.2710 232.4393 4.2276 18.1625 4.0128 1.4832 13.5438 4.9461 1.0392 7.3161 71.8979 60.1427 7.0496 11.6351 29.0845 91.4336 216.8334 40.8000 0.2640 9.5135 18.6198 9.7033 46.1026 39.1401 22.0504 22.1409 12.7813 4.8399 15.1179 203.2949 62.2778 35.2108 331.5002 19.1818 13.0931 17.9519 10.1082 7.6355 27.3751 39.9307 6.6634 3.6736 65.3004 4.4090 59.1384
temp: 298.150 k
press: 1.00000 atm
elementType: 8 8 8 7 7 6 6 6 6 6 6 1 1 1 1 1 1 1 1 1 1 1 1
symmnumber: 1
zpe: 491544.4 jmol-1
zpe.correction: 0.187219 hartree
zpe.thermalcorrener: 0.200185 hartree
zpe.thermalcorrenthalpy: 0.201129 hartree
zpe.thermalcorrgfe: 0.146569 hartree
zpe.sumelectzpe: -570.148673 hartree
zpe.sumelectthermal: -570.135708 hartree
zpe.sumelectthermalent: -570.134763 hartree
zpe.sumelectthermalfe: -570.189323 hartree
dipole: -5.3510 -0.2698 2.2757
dipole: 5.8211
quadrupole: -70.0558 -59.2596 -70.9313
quadrupole: -1.2441 9.2344 1.7835
quadrupole: -3.3069 7.4893 -4.1824 -1.2441 9.2344 1.7835
hfenergy: -570.3358922 hartree
pointgroup: C01 [X(C6H12N2O3)]
dipole: 1.8184699 0.6169125 -1.2480364 debye
dipolederiv: -1.7723932 0.1698895 0.0447642 0.137101 -0.2843674 -0.0709048 -0.0449063 -0.0488412 -0.4383206 -0.8213665 -0.0451777 0.0253804 -0.1640276 -0.3901095 -0.0986092 -0.360107 -0.3038703 -0.8445203 -0.5038163 -0.0662017 0.2443981 -0.2131292 -0.6400448 0.2318925 0.298244 0.0639071 -0.8967261 -0.536071 0.0703437 0.2760512 0.0865632 -0.6708588 -0.1922523 0.3007231 -0.2991029 -0.4746503 -0.7046194 0.0142964 -0.0275483 0.079261 -0.5264084 -0.390785 0.0445894 -0.2137161 -0.929822 0.3239206 0.1763763 -0.0823203 0.1288237 0.4187409 -0.046077 -0.0911488 0.0662783 0.1953805 -0.0784529 -0.1728428 0.0539264 -0.1296745 -0.2939984 0.0023888 0.0995823 -0.0328351 0.0762628 1.7054368 -0.1326754 0.033019 -0.0456574 0.1993423 0.2600083 0.554974 0.3222928 0.8714851 0.3360117 0.0879329 -0.4385884 0.2451882 1.0449494 0.1194176 -0.5365143 0.1132971 1.3572516 0.8383583 -0.0799879 -0.1247149 -0.1291972 0.3616949 0.0003737 -0.2825636 0.0039172 0.3079577 -0.1375986 0.002459 -0.04151 0.0072435 0.0582219 -0.0032674 -0.0234286 -0.0048888 0.0274092 0.0445059 0.0300182 -0.0490753 0.0259542 0.0185957 0.033765 -0.0484122 0.0356853 -0.0344138 0.0248119 0.0366716 0.0547473 0.0259276 0.0441163 -0.0322688 0.0682597 -0.0387824 0.0398142 0.092697 -0.0115304 -0.0271682 -0.018632 0.0123704 0.0448796 -0.0876192 0.0857965 -0.0808065 0.2918097 -0.0654395 -0.0612371 -0.0594122 0.1947417 0.0270475 -0.1022008 0.0980287 0.0583464 0.0583535 -0.1067145 -0.0976845 -0.071049 0.1694877 0.0710819 -0.0534553 0.1193831 0.312137 -0.0378592 -0.059494 -0.0134752 0.0008462 -0.098224 -0.071277 0.063311 -0.0542434 0.0381597 -0.0307829 0.048584 -0.0263523 0.0338817 -0.0093771 0.1035555 0.0653319 0.0690104 -0.066294 -0.0809544 0.0442645 0.0937723 0.0521227 0.0985078 -0.0452473 0.1149039 -0.0461412 0.000306 0.0939147 -0.0087954 -0.0138441 -0.0588835 -0.1151079 -0.0691222 -0.0576252 -0.0591332 0.0765527 0.100633 -0.0171255 0.0052366 -0.003736 0.0133009 0.1140305 -0.0565364 0.1117663 -0.0451644 0.4533747 0.0931465 0.0990459 0.1080954 0.2662187 -0.0010708 0.046386 0.0022615 0.2392982 0.3400866 -0.0079978 0.0731771 -0.0376099 0.1282078 0.012441 0.0882124 0.0099303 0.2103569 unknown
polarizability: 100.0686421|2.9928726|85.4210532|-7.2120761|6.6084228|82.9050836 unknown
InChI: InChI=1S/C6H12N2O3/c1-2-11-6(10)4(7)3-5(8)9/h4H,2-3,7-8H2,1H3
charge 0 multiplicity 1
23 atoms
O  1.584076 0.158737 0.341053
O  -0.033425 -0.185233 -1.298113
O  -2.880237 -1.755364 1.890204
N  -0.593073 2.144566 1.03651
N  -2.123694 -2.003818 -0.296405
C  -0.68902 0.670646 0.96482
C  -2.152959 0.260356 0.682956
C  0.273946 0.141475 -0.120321
C  -2.41896 -1.247875 0.82382
C  2.650582 -0.225714 -0.64058
C  3.984135 -0.102038 0.087567
H  -0.36984 0.263466 1.939914
H  -2.7781 0.774258 1.429473
H  -2.438759 0.610314 -0.327292
H  -0.901015 2.629149 0.186898
H  0.299787 2.494328 1.39659
H  2.445272 -1.256627 -0.980648
H  2.57483 0.447687 -1.513441
H  4.807952 -0.385124 -0.592608
H  4.156204 0.933509 0.427389
H  4.016392 -0.767326 0.966973
H  -1.654142 -1.578814 -1.100367
H  -2.273752 -3.011757 -0.258792
