program: Gaussian 09
title: 000090456
version: EM64L-G09RevD.01
frameworkgroup: C1[X(C16H20N2O4)]
method: RPBEPBE
basis: SDD
operation: Freq
keyword: #p
keyword: freq=noraman
keyword: PBEPBE/SDD
title: #p freq=noraman PBEPBE/SDD
converged: YES YES NO NO
title: Mulliken charges:
elementType: O O O O N N C C C C C C C C C C C C C C C C H H H H H H H H H H H H H H H H H H H H
charge: -0.260369 -0.260340 -0.250407 -0.250413 -0.462938 -0.462948 0.327055 0.327069 0.293007 0.292954 -0.560883 -0.560906 -0.845246 -0.845248 0.178084 0.178071 -0.629381 -0.629398 0.281040 0.281058 -0.768974 -0.768965 0.307008 0.306981 0.386914 0.386910 0.239417 0.245898 0.229353 0.239425 0.245896 0.229349 0.269973 0.263212 0.269969 0.263224 0.250801 0.245175 0.261297 0.261298 0.245170 0.250809
chargesum: 0.00000
title: Mulliken charges with hydrogens summed into heavy atoms:
elementType: O O O O N N C C C C C C C C C C C C C C C C
charge: -0.260369 -0.260340 -0.250407 -0.250413 -0.076025 -0.076038 0.327055 0.327069 0.293007 0.292954 -0.253874 -0.253926 -0.130578 -0.130579 0.178084 0.178071 -0.096196 -0.096204 0.281040 0.281058 -0.011701 -0.011688
polarizability: 3.51716687e+02 -1.43302831e+01 2.12735039e+02 -1.03131784e-03 1.37436049e-03 1.14121413e+02
1716.lowfreq: -10.9541 -6.0414 -4.7647 -0.0004 0.0004 0.0005 9.7652 21.2491 30.0255
frequency: 9.7562 20.6772 30.0106 48.9961 49.5306 55.9689 74.8940 80.0463 104.5553 114.0459 128.8795 148.2892 148.5242 163.5770 175.5883 178.5387 188.5920 234.0186 249.1617 264.8778 276.8962 292.7242 298.3599 349.2932 364.3997 380.1238 415.0870 439.1239 456.6106 457.2665 458.9007 495.4535 522.2162 549.8012 554.7066 570.9824 589.5845 633.0615 649.4626 695.5736 706.3403 742.7137 782.4285 810.3470 814.0480 848.0659 854.1610 879.7446 890.4477 898.8460 922.0476 926.5788 927.7902 932.1032 976.8006 979.2890 1002.6916 1019.4662 1020.7891 1021.8273 1042.5211 1046.7069 1089.7041 1156.6299 1160.1560 1175.0741 1181.9238 1190.9092 1199.3170 1218.3399 1240.7466 1282.9493 1309.4578 1310.1723 1334.7945 1372.3329 1372.5388 1375.3287 1399.9085 1401.4730 1417.0416 1419.0617 1419.6247 1440.5118 1440.5243 1451.4325 1451.4340 1463.9116 1476.5954 1480.9754 1481.4600 1500.4493 1527.9230 1562.7451 1591.8773 1600.2594 1605.7983 1629.1040 1636.9601 1643.9426 2966.8870 2967.1594 2973.6832 2973.7031 2981.3954 2981.4021 3037.6646 3037.6821 3063.5995 3063.6093 3086.3024 3086.3390 3094.2082 3094.2402 3126.6710 3126.6774 3176.8746 3178.9452 3321.6818 3322.7131
redmass: 3.9471 3.1343 4.9158 3.9766 4.6151 5.7675 4.8413 2.9466 4.0280 4.7323 3.1211 1.1490 1.2133 3.8331 1.2187 1.9103 1.8052 3.5629 4.1013 3.2593 3.1693 4.1722 4.5100 3.6744 3.6936 4.8862 5.4846 3.9971 3.1893 2.4497 2.9995 3.9265 3.8569 3.8263 3.6499 4.0042 4.3745 4.6458 4.3443 5.6141 4.6663 3.4271 4.0343 1.9102 2.1581 1.7116 1.4028 1.9123 2.0034 2.3891 1.3026 4.8589 1.3728 4.2848 1.8601 1.7834 1.6957 1.5792 1.8122 1.6564 1.5542 1.5175 5.0938 1.5822 1.4188 2.2205 1.9754 2.9594 1.7999 3.3122 2.4609 1.3152 1.8636 1.8347 4.8012 1.2648 1.2490 4.7568 1.2925 1.2064 3.1403 1.0939 1.2334 1.0764 1.0743 1.0557 1.0559 1.1899 1.5229 1.0652 1.0487 1.9212 2.1278 2.0759 4.6657 6.8098 6.7575 7.9557 3.5534 3.1166 1.0396 1.0396 1.0666 1.0666 1.0389 1.0389 1.0971 1.0972 1.0954 1.0954 1.0916 1.0916 1.0963 1.0964 1.1003 1.1003 1.0920 1.0927 1.0800 1.0798
irintensity: 0.8614 3.9092 0.3783 1.5687 1.3275 3.0371 23.0058 2.5955 4.9662 3.8303 0.8765 3.7850 0.8324 0.1186 0.6050 15.6237 10.0398 0.2151 0.3869 1.8988 0.7963 0.0000 10.0767 20.7063 0.5358 2.5933 0.1839 0.6320 4.6153 6.7160 5.6898 0.8206 0.0044 43.3779 3.6504 20.6606 0.6010 7.9571 0.0116 1.0111 4.9826 0.4580 8.1202 14.9809 7.9162 4.8957 94.3620 0.1161 17.6522 1.1378 0.0248 15.6252 44.8156 1.0239 10.0009 38.3659 19.8422 14.5630 5.4727 15.2780 0.0041 18.7717 0.0768 22.7322 11.8930 65.5597 10.5308 38.3024 89.7779 12.5779 233.9187 1.2558 153.4415 21.6734 0.8967 157.2073 34.3610 41.1287 27.1148 0.0086 148.5011 16.3331 29.1871 56.4713 0.0929 23.3891 15.1255 1.6640 248.0135 14.4208 25.0195 49.9469 2.0972 1294.2968 2.1863 31.7683 0.0005 0.1581 393.4740 0.0134 53.1852 0.6214 3.2893 1.2709 1.7244 1.3019 35.4761 0.8149 8.0528 8.3241 16.2919 2.1975 32.9809 0.6456 19.3045 2.6996 6.9435 0.0021 513.2562 11.6415
temp: 298.150 k
press: 1.00000 atm
elementType: 8 8 8 8 7 7 6 6 6 6 6 6 6 6 6 6 6 6 6 6 6 6 1 1 1 1 1 1 1 1 1 1 1 1 1 1 1 1 1 1 1 1
symmnumber: 1
zpe: 877094.4 jmol-1
zpe.correction: 0.334068 hartree
zpe.thermalcorrener: 0.357701 hartree
zpe.thermalcorrenthalpy: 0.358645 hartree
zpe.thermalcorrgfe: 0.277580 hartree
zpe.sumelectzpe: -1030.519330 hartree
zpe.sumelectthermal: -1030.495697 hartree
zpe.sumelectthermalent: -1030.494753 hartree
zpe.sumelectthermalfe: -1030.575818 hartree
dipole: -0.0009 -0.0008 0.2586
dipole: 0.2586
quadrupole: -59.6498 -149.3656 -128.0032
quadrupole: 2.2538 0.0046 -0.0030
quadrupole: 52.6897 -37.0260 -15.6637 2.2538 0.0046 -0.0030
hfenergy: -1030.8533979 hartree
pointgroup: C01 [X(C16H20N2O4)]
dipole: 0.0003028 0.0002689 0.1017498 debye
polarizability: 353.1764979|-0.5814382|211.2751718|0.0409868|0.0691118|114.1214695 unknown
InChI: InChI=1S/C16H20N2O4/c1-9-5-14(18-16(22)8-12(4)20)10(2)6-13(9)17-15(21)7-11(3)19/h5-6,17-18H,7-8H2,1-4H3
charge 0 multiplicity 1
42 atoms
O  -3.534118 2.088593 -0.297764
O  3.535718 -2.088318 -0.298999
O  -4.857479 -1.969444 0.193347
O  4.858044 1.969169 0.19789
N  -2.836557 -0.167404 -0.358308
N  2.837827 0.167687 -0.357032
C  -1.414423 -0.059718 -0.350428
C  1.415713 0.059932 -0.349783
C  -0.660003 -1.272738 -0.349568
C  0.661265 1.272935 -0.34741
C  -0.74608 1.191645 -0.347708
C  0.747336 -1.191446 -0.349194
C  -1.34308 -2.630653 -0.351529
C  1.344344 2.630849 -0.347062
C  -3.776088 0.843095 -0.331935
C  3.777493 -0.842753 -0.3316
C  -5.252496 0.368401 -0.408403
C  5.253852 -0.367731 -0.407016
C  -5.63092 -0.965992 0.234406
C  5.631851 0.965937 0.237534
C  -6.983423 -1.040415 0.915051
C  6.984236 1.039839 0.918469
H  -1.344207 2.10524 -0.342842
H  1.345456 -2.105048 -0.345431
H  -3.237699 -1.120099 -0.325154
H  3.238923 1.120366 -0.322579
H  -2.006644 -2.768588 0.524351
H  -0.594086 -3.438373 -0.329045
H  -1.965131 -2.782519 -1.255773
H  2.007754 2.767359 0.529156
H  0.595347 3.438532 -0.323431
H  1.966573 2.784178 -1.25094
H  -5.506289 0.289711 -1.487802
H  -5.869519 1.187901 -0.005545
H  5.507968 -0.287677 -1.486236
H  5.870877 -1.187619 -0.004948
H  -6.971208 -0.417702 1.831036
H  -7.776103 -0.628926 0.262946
H  -7.221399 -2.079484 1.188839
H  7.221886 2.078621 1.193627
H  7.77712 0.629402 0.265952
H  6.972066 0.415956 1.833659
