program: Gaussian 09
title: 000090384
version: EM64L-G09RevD.01
frameworkgroup: C1[X(C12H9PS3)]
method: RPBEPBE
basis: SDD
operation: Freq
keyword: #p
keyword: freq=noraman
keyword: PBEPBE/SDD
title: #p freq=noraman PBEPBE/SDD
converged: YES YES NO NO
title: Mulliken charges:
elementType: S S S P C C C C C C C C C C C C H H H H H H H H H
charge: 0.288951 0.288690 0.288909 0.849507 -0.622645 -0.623220 -0.621596 -0.082693 -0.081806 -0.083608 -0.140892 -0.141028 -0.140717 -0.513075 -0.512914 -0.513065 0.274993 0.275162 0.275262 0.247015 0.247005 0.246972 0.264936 0.264953 0.264903
chargesum: 0.00000
title: Mulliken charges with hydrogens summed into heavy atoms:
elementType: S S S P C C C C C C C C C C C C
charge: 0.288951 0.288690 0.288909 0.849507 -0.622645 -0.623220 -0.621596 0.192300 0.193356 0.191655 0.106123 0.105977 0.106255 -0.248138 -0.247961 -0.248162
polarizability: 2.13074078e+02 -2.45172290e-01 2.12401949e+02 -2.39054588e-01 9.05722305e-02 1.54274735e+02
1716.lowfreq: -6.1385 -0.0026 -0.0010 0.0003 1.0769 5.5584 28.6800 33.6942 43.6514
frequency: 28.6212 33.6094 43.6427 53.2333 53.5579 70.2689 172.0111 198.4870 199.7930 222.5312 236.3435 236.7608 404.6746 414.9402 415.5795 483.2568 483.3388 494.2386 566.0555 566.6692 568.4596 610.6723 611.0233 614.7771 683.3656 683.9216 687.1195 699.4707 700.5036 700.8173 811.5073 812.0861 812.2409 840.2893 841.2632 849.1015 914.3293 915.1013 920.6679 926.6461 927.9025 943.0115 1053.7382 1054.7579 1055.9839 1091.6563 1091.8781 1093.6173 1204.6981 1206.5150 1208.5889 1317.5554 1319.3421 1319.6368 1446.8531 1447.8255 1448.1476 1513.4043 1515.1973 1515.8554 3169.4642 3169.7405 3170.3685 3186.3384 3186.6480 3187.3423 3233.8378 3233.9880 3234.3582
redmass: 7.8055 7.7873 6.4858 6.0335 6.0058 5.6334 8.2063 5.9258 5.9211 7.2262 6.9073 6.9042 8.8616 10.9168 10.9258 6.4593 6.4901 6.9657 3.3230 3.3343 3.3757 10.1929 10.2073 10.4523 7.6535 7.6628 7.6008 1.1783 1.1771 1.1780 4.6428 4.6563 4.6437 1.2536 1.2528 1.2438 1.3794 1.3832 1.3739 5.8984 5.8617 5.2228 1.7461 1.7604 1.7645 1.1145 1.1152 1.1355 1.3980 1.3916 1.3793 2.1534 2.1714 2.1699 8.1263 8.1830 8.1446 5.0590 5.0420 5.0062 1.0896 1.0896 1.0895 1.0974 1.0974 1.0975 1.1004 1.1004 1.1004
irintensity: 0.1758 0.1900 0.0917 0.3842 0.3728 0.3418 0.2130 1.5435 1.5162 2.7585 0.9620 0.9787 0.3450 10.3438 10.5092 28.4588 28.8972 16.9841 3.9299 3.6205 0.7101 1.7459 1.8206 0.4910 4.0629 4.0893 1.3857 101.0481 97.3014 108.2085 12.3282 10.4951 9.7679 13.7879 13.8304 7.5215 0.9383 0.9790 0.0856 1.7428 1.9311 14.9312 2.8798 4.6645 5.9471 0.8578 0.9392 8.2953 50.7360 40.2966 42.5722 0.6951 0.9928 1.1841 14.0842 3.7763 3.3415 0.6214 1.4202 1.4316 5.6209 5.0735 2.7467 2.6302 2.7609 4.4776 0.7949 0.8208 0.8154
temp: 298.150 k
press: 1.00000 atm
elementType: 16 16 16 15 6 6 6 6 6 6 6 6 6 6 6 6 1 1 1 1 1 1 1 1 1
symmnumber: 1
zpe: 443391.2 jmol-1
zpe.correction: 0.168879 hartree
zpe.thermalcorrener: 0.184313 hartree
zpe.thermalcorrenthalpy: 0.185258 hartree
zpe.thermalcorrgfe: 0.122961 hartree
zpe.sumelectzpe: -1996.912528 hartree
zpe.sumelectthermal: -1996.897093 hartree
zpe.sumelectthermalent: -1996.896149 hartree
zpe.sumelectthermalfe: -1996.958446 hartree
dipole: -0.0062 -0.0112 3.2290
dipole: 3.2290
quadrupole: -112.4981 -112.5936 -120.9104
quadrupole: -0.0459 -0.0224 0.0011
quadrupole: 2.8360 2.7404 -5.5764 -0.0459 -0.0224 0.0011
hfenergy: -1997.0814065 hartree
pointgroup: C01 [X(C12H9P1S3)]
dipole: -0.1547383 0.1408183 -1.2530463 debye
dipolederiv: -0.0342237 -0.0470891 -0.0387895 -0.0011309 -0.0509912 0.1836673 -0.1034507 0.1687596 -0.0708959 0.0715157 -0.0105997 0.1357501 0.0134638 -0.0544782 -0.0612681 0.1550894 0.0111604 -0.172671 -0.0878454 0.0073206 -0.144308 0.0433682 0.0544076 -0.0956745 -0.0889094 -0.1405128 -0.1225065 0.8953987 -0.0228977 -0.0585235 0.0367906 0.8983754 0.0427936 -0.0539655 0.0452693 0.4598057 -0.0251188 0.1565864 -0.1213695 0.1557083 -0.2079285 -0.2346289 -0.3839944 -0.2294496 -0.0985134 -0.3237149 0.1312309 -0.0676137 0.0606657 0.0225107 0.2215998 0.0660339 0.4447115 -0.032358 0.0218951 -0.2401019 0.1986866 -0.2547892 -0.1459038 0.0233081 0.3212064 -0.2092112 -0.2054293 -0.1285165 0.057912 -0.0720481 -0.0467869 -0.1071636 0.0367471 0.1338227 0.0330259 -0.1669119 -0.1122158 -0.0011542 0.0526211 -0.0440259 -0.1138015 0.0642324 -0.0582498 -0.1363871 -0.1756241 -0.1152649 0.0636522 0.0155938 -0.0253309 -0.137089 -0.0705209 -0.1079448 0.1018636 -0.1518195 -0.0951081 -0.0637205 0.1408913 -0.0187095 -0.1344589 0.022345 0.0518099 -0.0184494 -0.1197171 -0.1167232 0.0075278 -0.0526781 0.0224567 -0.1306776 -0.1471407 -0.0421233 -0.0409555 -0.1041916 -0.1674258 0.0101248 -0.0837649 0.037161 -0.1136082 0.1092756 0.0057321 0.0547177 -0.0670023 -0.2209898 -0.069235 0.1715293 -0.0530651 -0.0829114 -0.2911931 0.0796639 -0.2585974 0.0437437 -0.2179137 -0.0024797 -0.2610616 -0.0067071 -0.2417683 -0.0234816 -0.1859184 0.0435457 0.2018616 -0.1344611 0.046397 0.207101 0.0652477 -0.2458588 0.2107218 0.228714 0.1161614 0.1197603 0.1095583 -0.0406442 0.0392595 -0.0880831 0.0816225 0.0629749 0.0628501 0.0837761 0.0766073 0.1594755 0.0356233 0.0121794 -0.0013356 0.058007 -0.0692912 0.0161282 -0.1126418 0.0499437 0.0184436 0.06432 -0.0538336 0.0259399 0.1485201 0.0192986 -0.0955626 0.0267493 0.0995942 0.0345707 0.0250502 -0.0541805 0.0523962 0.0984646 0.1074283 -0.105402 0.1004948 0.0604591 0.1199081 -0.0532313 0.0990301 -0.0417206 0.080179 0.008229 0.119557 0.0618677 -0.0068751 0.1067815 0.0001469 -0.0745348 0.0217851 0.0815313 -0.0974952 -0.0367986 -0.1365124 0.0051273 -0.0228597 -0.0431239 -0.0120954 -0.0052983 0.1615978 0.0608621 -0.0416591 0.0621769 0.1486773 0.1732542 -0.0864504 0.0458068 -0.058036 0.0021882 -0.0127748 0.063771 0.0215775 0.1125016 0.0915801 0.0748354 -0.0236479 0.1100359 0.0792346 -0.0700145 -0.0004 -0.0931403 0.1164338 unknown
polarizability: 212.0739075|1.1460867|211.9117493|-6.6389173|6.3489487|155.7651063 unknown
InChI: InChI=1S/C12H9PS3/c1-4-10(14-7-1)13(11-5-2-8-15-11)12-6-3-9-16-12/h1-9H
charge 0 multiplicity 1
25 atoms
S  -2.96809 -0.891599 1.427661
S  0.92444 2.98986 1.39036
S  2.288488 -2.252641 0.641274
P  0.093934 -0.070621 1.336968
C  -1.644327 0.08134 0.664826
C  0.873309 1.410564 0.50388
C  0.73737 -1.42053 0.214085
C  -2.153739 0.898851 -0.337642
C  1.512249 1.519526 -0.72588
C  0.182315 -1.97891 -0.931662
C  -3.577831 0.768003 -0.532188
C  2.038686 2.835595 -0.997474
C  0.964575 -3.051706 -1.497782
C  -4.168144 -0.152033 0.32032
C  1.805949 3.743511 0.023953
C  2.124526 -3.32131 -0.788291
H  -1.520646 1.580465 -0.910722
H  1.606156 0.672539 -1.409826
H  -0.766029 -1.630967 -1.348287
H  -4.139542 1.335847 -1.277983
H  2.569657 3.095138 -1.91665
H  0.674694 -3.599826 -2.397633
H  -5.211757 -0.454626 0.390871
H  2.082807 4.794777 0.086551
H  2.896048 -4.063545 -0.987129
