program: Gaussian 09
title: 000090389
version: EM64L-G09RevD.01
frameworkgroup: C1[X(C13H20O)]
method: RPBEPBE
basis: SDD
operation: Freq
keyword: #pfreq=noraman
keyword: PBEPBE/SDD
title: #p freq=noraman PBEPBE/SDD
converged: YES YES NO NO
title: Mulliken charges:
elementType: O C C C C C C C C C C C C C H H H H H H H H H H H H H H H H H H H H
charge: -0.237108 0.345546 -0.291492 -0.498625 -0.451328 0.410789 -0.766020 -0.761098 -0.384035 -0.118283 -0.837681 -0.337932 0.186723 -0.784626 0.197482 0.220684 0.211934 0.214939 0.220067 0.213675 0.239873 0.208194 0.211862 0.210092 0.235559 0.213348 0.292231 0.240809 0.228599 0.219745 0.225537 0.253884 0.232872 0.233785
chargesum: 0.00000
title: Mulliken charges with hydrogens summed into heavy atoms:
elementType: O C C C C C C C C C C C C C
charge: -0.237108 0.345546 -0.094010 -0.066008 -0.016322 0.410789 -0.104277 -0.103585 -0.170687 0.173948 -0.148528 -0.112395 0.186723 -0.064086
polarizability: 1.88325680e+02 -2.09291521e+00 1.23634772e+02 -1.28408913e+01 -1.89313758e+00 1.26762548e+02
1716.lowfreq: -9.1221 0.0005 0.0006 0.0008 3.8119 8.5058 33.4631 48.3784 64.0968
frequency: 33.3417 48.2134 64.0841 97.8052 113.8075 142.6553 160.8179 177.8613 192.8305 204.7785 239.0854 251.8681 266.5748 287.8501 312.5412 334.3283 347.1425 399.3469 409.4489 444.4131 467.7939 506.2202 539.6181 574.5073 620.0809 631.8780 727.7494 802.6963 825.2389 850.0060 881.0405 885.6185 920.9917 935.6077 938.6897 948.9564 962.8016 986.3039 1001.6774 1012.6651 1027.0790 1030.5563 1045.9652 1092.9196 1094.9654 1131.2034 1140.8921 1172.2078 1187.2544 1201.6054 1218.7530 1240.0477 1264.0037 1280.8206 1302.3003 1323.6119 1332.0781 1338.3342 1346.6005 1365.6912 1373.5542 1394.1770 1394.5974 1442.5955 1455.3784 1456.8550 1460.0487 1460.2681 1466.7040 1474.0359 1477.3334 1479.6947 1489.8009 1577.4258 1645.5393 1684.6558 2950.8318 2953.9259 2960.1987 2967.3455 2970.6318 2977.0229 2980.7928 3003.4882 3033.5209 3036.2699 3058.1637 3059.4758 3064.1807 3068.6752 3076.9862 3078.6477 3090.5333 3091.6022 3102.7167 3123.2414
redmass: 3.2729 3.5537 4.1156 1.0811 3.8551 2.8419 1.4670 1.8216 2.0727 1.1192 1.1833 3.0140 2.2331 1.8340 2.6483 2.4204 2.8311 2.8943 2.4751 3.1387 3.5418 2.8967 3.4701 2.7518 3.4246 3.1214 2.0677 1.8573 1.6551 2.5571 2.0635 2.0078 2.3206 1.5667 2.0879 1.7345 1.8255 1.4164 1.2298 1.4772 1.7927 1.7426 1.5290 1.6086 3.0645 1.7149 1.6792 1.4920 2.1715 2.6911 1.7159 1.6913 1.8961 1.3542 1.5667 1.7768 1.6305 1.4611 1.5970 1.2648 1.2012 1.2092 1.2339 1.0878 1.0503 1.0763 1.0555 1.0483 1.0558 1.0573 1.0670 1.0761 1.0575 7.6191 6.2743 6.6874 1.0648 1.0795 1.0408 1.0355 1.0369 1.0374 1.0624 1.0909 1.0959 1.1020 1.0995 1.0964 1.0985 1.0992 1.0989 1.0982 1.0907 1.0906 1.0896 1.0994
irintensity: 2.8973 1.5970 1.6783 0.0263 2.9623 0.5851 0.4235 0.3298 0.5288 0.2167 0.6199 0.9151 1.2809 2.7348 0.3565 0.5696 0.2409 0.7239 1.2845 3.5849 0.3730 5.0354 31.5695 3.4547 0.5408 0.7597 10.1755 13.0025 13.4655 3.4399 1.7951 0.6908 1.7424 1.2975 3.6420 35.4948 1.9731 1.2755 35.4995 19.7480 0.7745 3.1933 4.4112 3.2978 5.6597 5.5288 13.5723 7.7344 34.4237 20.3025 12.2190 65.7847 5.3828 34.6051 12.8222 6.0653 35.9324 4.7311 10.7833 75.0114 25.2909 21.3905 9.9747 28.2838 18.6462 5.5889 2.0717 14.1648 8.9969 11.7837 12.8104 6.6219 9.9614 204.5621 122.3604 0.5231 38.3409 14.9145 49.8173 25.3574 36.0899 3.8940 30.2448 40.3058 19.4532 41.3825 1.2187 14.9872 67.0618 39.4617 32.5279 19.9763 3.9494 41.5187 15.5591 19.8270
temp: 298.150 k
press: 1.00000 atm
elementType: 8 6 6 6 6 6 6 6 6 6 6 6 6 6 1 1 1 1 1 1 1 1 1 1 1 1 1 1 1 1 1 1 1 1
symmnumber: 1
zpe: 771990.5 jmol-1
zpe.correction: 0.294036 hartree
zpe.thermalcorrener: 0.310096 hartree
zpe.thermalcorrenthalpy: 0.311040 hartree
zpe.thermalcorrgfe: 0.250836 hartree
zpe.sumelectzpe: -581.487430 hartree
zpe.sumelectthermal: -581.471370 hartree
zpe.sumelectthermalent: -581.470426 hartree
zpe.sumelectthermalfe: -581.530630 hartree
dipole: -1.7893 0.3969 -2.9181
dipole: 3.4459
quadrupole: -85.9004 -85.3547 -89.4162
quadrupole: 1.8833 -12.5377 0.3622
quadrupole: 0.9901 1.5357 -2.5258 1.8833 -12.5377 0.3622
hfenergy: -581.7814653 hartree
pointgroup: C01 [X(C13H20O1)]
dipole: 0.7093158 -0.0959716 -1.1513862 debye
polarizability: 188.3866416|-0.1863684|123.427493|12.7805203|2.245205|126.908865 unknown
InChI: InChI=1S/C13H20O/c1-10-6-5-9-13(3,4)12(10)8-7-11(2)14/h6-8,12H,5,9H2,1-4H3
charge 0 multiplicity 1
34 atoms
O  -3.310785 0.182332 1.542232
C  1.479418 1.181913 -0.301272
C  0.521666 -0.025384 -0.631825
C  2.032499 1.00799 1.142638
C  2.821493 -0.308281 1.329356
C  1.153758 -1.386061 -0.271177
C  2.640657 1.194239 -1.330883
C  0.71226 2.523919 -0.405396
C  2.169686 -1.484691 0.630803
C  -0.811861 0.067545 0.081926
C  0.56871 -2.598287 -0.969518
C  -2.039251 -0.017856 -0.508668
C  -3.304157 0.047899 0.281064
C  -4.603358 -0.051678 -0.513073
H  0.328683 -0.015353 -1.726473
H  1.187705 1.032336 1.858487
H  2.678744 1.872796 1.391135
H  2.935401 -0.529235 2.40958
H  3.856418 -0.193331 0.941082
H  3.383775 1.969806 -1.06507
H  3.160075 0.221235 -1.37952
H  2.260295 1.426195 -2.343867
H  1.404946 3.374599 -0.26109
H  0.238431 2.635954 -1.3993
H  -0.085022 2.602291 0.356224
H  2.586007 -2.479528 0.848266
H  -0.791333 0.169605 1.177903
H  -0.524887 -2.664368 -0.809929
H  1.02472 -3.535784 -0.606559
H  0.729196 -2.542524 -2.065189
H  -2.129582 -0.129967 -1.598481
H  -5.467836 0.009152 0.1654
H  -4.642169 -1.005426 -1.073669
H  -4.663504 0.763948 -1.259137
