program: Gaussian 09
title: 000090364
version: EM64L-G09RevD.01
frameworkgroup: C1[X(C6H6BrNO)]
method: RPBEPBE
basis: SDD
operation: Freq
keyword: #p
keyword: freq=noraman
keyword: PBEPBE/SDD
title: #p freq=noraman PBEPBE/SDD
converged: NO NO NO NO
title: Mulliken charges:
elementType: Br O N C C C C C C H H H H H H
charge: 0.034580 -0.242371 0.067162 0.462247 -0.274094 -0.438967 -0.168981 -0.349462 -0.539522 0.255698 0.232967 0.250622 0.256822 0.226651 0.226648
chargesum: 0.00000
title: Mulliken charges with hydrogens summed into heavy atoms:
elementType: Br O N C C C C C C
charge: 0.034580 -0.242371 0.067162 0.462247 -0.018396 -0.438967 0.063986 -0.098840 0.170599
polarizability: 1.21531113e+02 -1.19190007e+01 1.07588199e+02 -2.61914281e-04 -2.33483738e-03 3.85339720e+01
1716.lowfreq: -10.6579 -9.1522 -3.5781 -0.0008 -0.0005 0.0004 95.8247 115.5058 148.3694
frequency: 95.7383 115.5018 148.3690 224.8541 264.8026 282.9118 292.7178 459.4988 470.3829 544.2155 551.0254 644.4704 739.5115 770.8623 799.7410 892.5092 961.7441 963.6152 1031.9254 1057.2382 1110.5454 1116.6107 1159.3225 1217.0286 1260.6126 1340.3774 1406.0917 1410.3051 1447.1480 1470.7984 1471.0587 1537.4559 1568.9600 2962.9100 3052.8090 3134.7865 3146.6545 3160.4398 3177.2283
redmass: 3.3479 4.6824 6.4619 1.3216 4.7513 2.7507 6.8218 4.2597 6.1130 6.2019 4.1200 6.8520 3.3311 7.0196 1.5177 1.3626 1.3648 8.4904 7.1066 2.4229 1.2591 1.5378 1.3529 1.8357 2.2642 8.2031 2.6327 1.6599 1.4067 1.0577 1.0498 5.2048 6.5305 1.0333 1.1042 1.0993 1.0867 1.0922 1.1006
irintensity: 2.5255 7.5201 2.2801 0.5327 1.6226 0.2012 2.9226 0.0637 2.6284 24.0853 1.5240 20.8379 10.5336 12.3333 71.6258 0.0099 1.0021 11.0848 87.6202 22.1611 0.1559 33.9316 3.3806 63.3411 98.4786 14.7078 188.1735 42.3661 31.1925 21.1546 15.4452 31.9220 41.2657 52.7189 42.9247 14.7063 0.0836 14.4872 21.4001
temp: 298.150 k
press: 1.00000 atm
elementType: 35 8 7 6 6 6 6 6 6 1 1 1 1 1 1
symmnumber: 1
zpe: 283890.5 jmol-1
zpe.correction: 0.108128 hartree
zpe.thermalcorrener: 0.116548 hartree
zpe.thermalcorrenthalpy: 0.117493 hartree
zpe.thermalcorrgfe: 0.073569 hartree
zpe.sumelectzpe: -374.983401 hartree
zpe.sumelectthermal: -374.974981 hartree
zpe.sumelectthermalent: -374.974037 hartree
zpe.sumelectthermalfe: -375.017961 hartree
dipole: 5.2504 2.3542 0.0008
dipole: 5.7541
quadrupole: -52.5029 -54.4015 -64.0135
quadrupole: 1.0017 0.0005 0.0020
quadrupole: 4.4697 2.5712 -7.0409 1.0017 0.0005 0.0020
hfenergy: -375.0915294 hartree
pointgroup: C01 [X(C6H6Br1N1O1)]
dipole: -0.9514185 2.0541933 0.00031 debye
dipolederiv: -0.0935684 -0.2029214 0.0000043 -0.2527725 -0.8081891 0.0000071 0.0000118 0.0000177 -0.0519776 -1.6212703 0.169026 -0.0000124 -0.076256 -0.2169842 0. -0.0001687 -0.0000411 -0.2764425 -0.5618995 -0.4522284 0.0000156 0.0479613 -0.4145264 0.0000096 -0.0000126 -0.0000326 -0.1674343 1.384511 -0.0239379 0.0001124 0.2741597 -0.5189717 -0.0000412 0.0002898 0.0000203 0.1854836 -0.1162171 0.2477789 0.0000003 -0.2984173 0.0978092 -0.0000138 -0.0000793 -0.0000165 -0.1833138 0.1294275 0.5159776 -0.0000109 0.5317583 1.4989878 -0.000001 0.0000166 -0.0000375 -0.0673485 -0.0680348 -0.2175526 0.0000147 0.1203307 0.0532286 0.0000226 0.0000215 -0.0000195 -0.1073009 0.3065157 0.2437329 0.0000141 -0.1077497 0.0106075 -0.0000125 0.0000075 -0.0000086 -0.109568 0.6671619 -0.1635329 -0.0000256 -0.3792235 0.3398312 -0.0000024 -0.0000767 0.0000749 0.3204787 0.0134892 0.0854789 -0.0000117 0.0866478 0.0018839 0.0000037 -0.0000206 0.0000084 0.1675699 0.0765401 -0.0436791 -0.000006 -0.0801376 -0.0896485 -0.0000088 0.0000088 0.0000028 0.1631733 -0.0843504 -0.076792 -0.0000116 -0.0358162 0.0559251 -0.000002 -0.0000207 0.000005 0.1585039 -0.0888761 -0.0414465 0.000048 -0.0967219 0.056966 0.0000302 0.0000492 0.0000082 0.1289644 0.0282924 -0.0199038 0.0518191 0.1331656 -0.0335041 0.1092814 -0.0128297 0.1048503 -0.0803776 0.0282788 -0.0199998 -0.0519502 0.1330714 -0.0334153 -0.109273 0.0128032 -0.1048317 -0.0804107 unknown
polarizability: 107.2985972|11.7448211|121.820714|0.0023379|-0.0002333|38.533972 unknown
InChI: InChI=1S/C6H6BrNO/c1-9-5-3-2-4-8-6(5)7/h2-4H,1H3
charge 0 multiplicity 1
15 atoms
Br -0.075696 -2.78274 -0.000064
O  -1.88764 -0.304103 -0.000427
N  1.75911 -0.617955 -0.000047
C  -0.565003 0.112015 -0.000227
C  -0.135877 1.464216 -0.000161
C  0.453458 -0.889167 -0.000124
C  1.248496 1.752741 -0.000046
C  2.170475 0.686119 -0.000028
C  -2.930626 0.726615 0.000143
H  -0.867201 2.277678 -0.000195
H  1.601643 2.788527 0.000008
H  3.251485 0.853666 0.000022
H  -3.878347 0.169976 0.000395
H  -2.869871 1.360407 -0.905988
H  -2.869206 1.360105 0.90644
