program: Gaussian 09
title: 000090371
version: EM64L-G09RevD.01
frameworkgroup: C1[X(C8H10BrNO3S)]
method: RPBEPBE
basis: SDD
operation: Freq
keyword: #p
keyword: freq=noraman
keyword: PBEPBE/SDD
title: #p freq=noraman PBEPBE/SDD
converged: YES YES NO NO
title: Mulliken charges:
elementType: Br S O O O N C C C C C C C C H H H H H H H H H H
charge: 0.043865 0.217455 -0.168498 -0.413564 -0.192829 -0.118113 -0.404450 -0.159719 -0.083044 -0.532913 0.213005 -0.653334 -0.685977 0.161756 0.330937 0.293783 0.325646 0.253981 0.242142 0.223987 0.231106 0.240727 0.245120 0.388931
chargesum: 0.00000
title: Mulliken charges with hydrogens summed into heavy atoms:
elementType: Br S O O O N C C C C C C C C
charge: 0.043865 0.217455 -0.168498 -0.024633 -0.192829 -0.118113 -0.073512 -0.159719 0.210738 -0.207267 0.213005 0.066776 0.030976 0.161756
polarizability: 1.77523339e+02 4.31128184e+00 1.17251468e+02 6.38414107e+00 -1.32154522e-01 1.04195403e+02
1716.lowfreq: -9.6873 -7.4110 0.0011 0.0025 0.0025 7.7148 29.9310 46.1922 54.1195
frequency: 29.2516 46.0391 54.1080 100.1377 108.8281 141.5451 175.8411 196.0653 225.9431 241.2939 251.4836 285.5766 290.4980 339.5484 357.7862 371.6635 423.7448 459.3085 505.6272 529.1924 552.8942 601.7645 625.6304 681.9617 693.8702 748.9510 781.6976 824.3711 839.6703 903.2550 936.3546 943.5054 980.7092 996.5314 1008.2673 1034.7342 1060.0026 1124.5994 1134.1329 1146.5704 1168.2242 1194.4895 1204.6878 1213.5915 1248.9417 1281.1966 1283.1816 1360.0550 1384.9190 1403.2673 1457.3746 1462.3252 1477.3383 1478.6137 1680.5026 1741.1112 2982.1819 2988.0210 3028.6100 3077.4018 3085.4804 3096.6681 3106.9406 3110.1978 3118.1858 3514.4324
redmass: 5.5351 9.3312 8.9124 7.8950 9.8710 8.1486 9.4930 5.0104 2.8789 1.5676 1.8150 1.6863 2.0790 3.9661 4.8847 3.6051 7.0615 4.0082 4.6242 5.6424 4.3192 2.2358 2.2362 4.7541 4.6797 8.3542 4.6832 4.2077 5.0838 5.3015 2.0682 1.7252 3.9983 3.5483 1.4331 2.7428 2.5005 1.7772 1.4688 1.1235 2.2173 2.2796 1.3387 1.5662 1.7358 1.8617 4.6514 1.5038 1.1950 1.1945 1.0496 1.0472 1.0490 1.0497 9.0836 12.6884 1.0382 1.0359 1.0842 1.0965 1.0991 1.1008 1.1000 1.0907 1.0885 1.0642
irintensity: 0.7303 0.7899 1.0789 1.4495 0.7133 1.1251 3.0836 1.9125 0.1910 1.3368 0.4122 0.6276 0.1459 0.0230 3.7260 7.5725 7.0772 5.7912 11.6945 60.4035 35.4459 80.6687 39.2436 6.1647 39.4106 16.1686 15.0844 7.6230 9.7524 14.3808 1.2480 1.6251 14.2697 20.3531 1.5389 158.7621 174.1543 50.2424 24.1470 14.0843 24.4304 36.9524 5.3373 5.0899 6.2449 56.7584 71.3496 24.8259 28.5694 16.0532 1.0619 6.4690 17.3870 8.1825 193.4911 411.9261 16.7169 16.6721 4.2898 12.6355 13.9578 14.0660 16.3660 6.3632 0.8246 36.0979
temp: 298.150 k
press: 1.00000 atm
elementType: 35 16 8 8 8 7 6 6 6 6 6 6 6 6 1 1 1 1 1 1 1 1 1 1
symmnumber: 1
zpe: 453988.2 jmol-1
zpe.correction: 0.172915 hartree
zpe.thermalcorrener: 0.187566 hartree
zpe.thermalcorrenthalpy: 0.188511 hartree
zpe.thermalcorrgfe: 0.129388 hartree
zpe.sumelectzpe: -1001.715322 hartree
zpe.sumelectthermal: -1001.700671 hartree
zpe.sumelectthermalent: -1001.699727 hartree
zpe.sumelectthermalfe: -1001.758849 hartree
dipole: 4.7454 2.4470 -0.8214
dipole: 5.4020
quadrupole: -86.9012 -103.6580 -104.7566
quadrupole: -6.1641 1.2878 2.4556
quadrupole: 11.5374 -5.2194 -6.3180 -6.1641 1.2878 2.4556
hfenergy: -1001.8882371 hartree
pointgroup: C01 [X(C8H10Br1N1O3S1)]
dipole: -1.8925592 0.9644592 0.0701383 debye
dipolederiv: -0.5362412 0.0285413 -0.1258212 0.0869227 -0.1094573 0.0211841 -0.2741251 0.0062799 -0.1834002 -0.5454605 0.093634 0.0150352 -0.0356826 -0.274415 -0.0158012 -0.0431184 -0.0084612 -0.1756736 -0.4894663 0.0534942 0.0715729 0.2509009 -0.764671 -0.4811328 0.3539816 -0.4711555 -0.725604 -1.0244478 -0.216296 -0.379559 -0.2897043 -0.4633278 -0.1905056 -0.3097802 -0.1709704 -0.4826652 -0.5380861 -0.1577797 -0.0444962 -0.0786231 -0.5408704 0.2697816 -0.1591566 0.2483522 -0.7375601 -1.0338228 0.1474606 0.2596434 0.2092324 -0.581478 -0.0654721 0.4712539 -0.2364559 -0.5159305 0.1725417 -0.0800614 0.1141802 -0.3855516 0.5786159 0.02659 -0.0509877 0.0865133 0.1994686 0.5194919 0.0161041 0.0124628 0.2156497 0.2786717 -0.0291612 -0.0269377 0.045119 0.1991107 0.3427249 -0.0447237 -0.0546891 -0.0289635 -0.1594018 0.0062151 0.1733084 0.0833778 0.0891804 0.6654123 -0.2045256 0.2397132 -0.257783 -0.034933 -0.2259506 0.3278662 -0.1678865 0.2019123 1.0910656 -0.2309759 -0.4498273 -0.0760096 0.868479 0.8024698 -0.7634666 0.7716303 0.9178231 -0.1006579 0.0425566 0.0331045 -0.0290357 -0.0315092 -0.0055248 0.0132626 -0.0269566 -0.1176341 -0.1161558 0.0348314 -0.0639798 -0.0601821 0.0025112 -0.0115077 0.0068509 0.0131146 -0.037564 1.1418173 0.5635646 0.3681302 0.4957065 0.7814925 -0.2669774 0.3458364 -0.3621995 0.9792295 0.0163089 0.0439105 -0.016675 0.0806423 -0.0301417 0.0216708 -0.0343363 -0.0036826 -0.0531502 0.0087651 -0.0288764 0.0237466 -0.0272435 0.0761644 -0.0137304 -0.0389147 -0.0201331 -0.0223784 0.0097533 0.0339325 -0.0771402 -0.0370491 0.0472866 0.0502164 -0.054909 0.04996 0.0158414 0.0216333 0.0343912 -0.1058505 0.0353117 0.0847839 0.0526587 -0.0794409 0.0460762 -0.0093924 0.0871132 0.035691 0.0245521 0.0776467 -0.0937673 -0.0428043 0.0070073 0.0044555 0.0941457 -0.1011458 -0.1069593 0.0364296 -0.1334497 0.0338588 0.0139738 0.0380764 -0.0041919 0.058664 0.0728278 0.0547448 0.0030525 0.1117583 -0.0884284 -0.0086417 0.002483 -0.051325 0.0789809 0.0619492 -0.0020324 0.110033 0.0253623 0.0912507 -0.0145083 0.0595856 -0.007906 -0.0791438 -0.0508835 -0.0810174 -0.0168981 -0.1051153 0.0485091 -0.0047165 -0.0216273 0.0180565 0.088309 0.3249633 -0.0296087 0.0232802 -0.0447404 0.2807771 0.1116743 0.0572882 0.158389 0.2174309 unknown
polarizability: 175.2213489|-3.5701335|117.1885258|14.4957491|-0.8143923|106.5603353 unknown
InChI: InChI=1S/C8H10BrNO3S/c1-8(2)4(7(12)13)10-5(11)3(9)6(10)14-8/h3-4,6,12H,1-2H3
charge 0 multiplicity 1
24 atoms
Br 4.103877 0.11402 0.967944
S  0.161381 2.321876 -0.17996
O  1.931349 -1.523873 -1.630973
O  -2.771394 -1.694593 -0.319891
O  -1.332946 -1.88636 1.501244
N  0.601847 -0.312966 0.010334
C  1.208549 0.925131 0.572685
C  -1.396535 1.145465 -0.111029
C  -0.810183 -0.319135 -0.36719
C  2.527837 0.56286 -0.183161
C  1.738895 -0.647594 -0.776493
C  -2.042011 1.292992 1.283638
C  -2.363422 1.553738 -1.235857
C  -1.610783 -1.376412 0.401821
H  1.252205 0.993512 1.667303
H  -0.894758 -0.556427 -1.444005
H  2.876103 1.294267 -0.925714
H  -1.359486 0.981869 2.092954
H  -2.321155 2.345961 1.452915
H  -2.961533 0.680378 1.353106
H  -2.760402 2.569085 -1.061653
H  -1.866429 1.538188 -2.221143
H  -3.216716 0.851256 -1.263649
H  -3.295291 -2.380537 0.176776
