program: Gaussian 09
title: 000090419
version: EM64L-G09RevD.01
frameworkgroup: C1[X(C19H21N2)]
method: RPBEPBE
basis: SDD
operation: Freq
keyword: #p
keyword: freq=noraman
keyword: PBEPBE/SDD
title: #p freq=noraman PBEPBE/SDD
converged: YES YES NO NO
title: Mulliken charges:
elementType: N N C C C C C C C C C C C C C C C C C C C H H H H H H H H H H H H H H H H H H H H H
charge: -0.190281 -0.140173 0.171507 0.233033 0.406390 0.310411 -0.296561 -0.292960 -0.330662 -0.576165 -0.675543 0.436611 -0.400775 -0.325146 -0.336477 0.414278 -0.351980 -0.363073 -0.791743 -0.639381 -0.639132 0.270850 0.269625 0.268030 0.259769 0.256865 0.291165 0.271379 0.251285 0.245717 0.257648 0.258816 0.258584 0.238020 0.248383 0.249383 0.240061 0.250471 0.250096 0.239372 0.250582 0.251720
chargesum: 1.00000
title: Mulliken charges with hydrogens summed into heavy atoms:
elementType: N N C C C C C C C C C C C C C C C C C C C
charge: -0.190281 -0.140173 0.171507 0.233033 0.406390 0.310411 -0.025711 -0.023334 -0.062632 -0.316396 0.143866 0.436611 -0.149490 -0.079429 -0.078829 0.414278 -0.093163 -0.104489 -0.055957 0.101247 0.102542
polarizability: 5.91360320e+02 3.65954875e+00 1.99215151e+02 -4.53723801e-01 2.10260675e+00 1.13847515e+02
1716.lowfreq: -6.8239 -0.0007 -0.0004 0.0007 1.9884 6.6276 30.0485 48.9702 49.6811
frequency: 30.0170 48.9660 49.6778 63.1067 83.4019 96.2193 134.6823 139.8760 146.5104 180.4442 195.6658 203.1995 223.0395 248.5701 259.8285 283.1976 299.2228 358.3460 385.2556 388.3749 406.1151 411.1304 433.0806 472.2226 479.4597 502.8801 506.5870 513.4403 540.8216 560.6285 573.5954 608.4946 628.2870 679.4714 712.4484 719.5338 737.5343 769.0402 770.3293 811.0387 818.8256 829.7478 841.8971 849.4624 906.0594 934.0058 934.7399 961.7742 970.5060 974.5127 983.7713 992.0308 1007.3810 1024.4781 1051.9879 1053.5867 1067.8252 1095.6335 1114.8851 1118.0548 1135.3256 1148.2548 1167.7406 1179.4881 1181.2708 1204.3131 1219.7278 1243.0593 1272.8797 1277.9113 1296.1537 1316.4685 1338.8104 1368.1544 1373.3701 1384.4709 1392.0675 1406.2693 1417.0115 1434.1208 1444.9406 1455.7301 1466.3422 1466.8410 1468.5990 1469.5526 1475.2675 1483.9778 1484.7833 1488.7594 1492.0916 1503.1376 1511.1060 1530.5954 1545.8022 1569.0964 1599.0523 1627.6033 1633.3106 2970.1712 2975.3597 2987.9963 3013.2680 3047.3157 3050.3942 3066.7300 3102.0153 3104.9453 3120.9117 3130.8519 3138.4186 3139.3949 3142.6670 3143.5867 3151.6189 3154.1865 3179.9310 3183.3590 3183.8719 3193.7912
redmass: 4.2614 3.4230 2.9208 1.0839 2.2102 3.5652 1.2030 3.0302 3.4868 1.4083 3.4687 4.2581 3.3843 3.3064 1.7771 1.9293 2.8253 3.3462 4.1002 3.3526 3.4838 2.8891 2.9785 3.6519 3.8393 5.0142 3.5694 3.1297 3.4888 3.3072 3.7788 4.6961 6.7989 3.8180 5.9234 4.7762 3.8594 3.8806 5.3523 1.2635 1.4460 1.6595 2.3338 2.0019 1.4575 3.0127 3.1152 1.3260 1.3288 1.3348 3.7177 1.3713 1.6566 2.6465 1.5849 1.5691 2.9338 1.2349 1.3471 1.3316 1.8282 1.5796 1.6508 1.3672 2.0034 1.4441 1.1376 2.5728 2.2718 2.1334 1.9958 1.6885 1.9856 2.5986 3.2354 2.7175 3.4596 1.2782 6.3541 1.1577 1.2807 1.2626 1.0696 1.9191 1.0539 1.3248 1.5596 1.0485 1.0686 1.3588 1.3144 1.2558 2.4930 5.0564 3.2576 6.0555 6.3654 6.0221 6.1651 1.0368 1.0388 1.0383 1.0359 1.1004 1.1031 1.0973 1.0991 1.1027 1.0979 1.0959 1.0899 1.0924 1.0900 1.0910 1.0993 1.0914 1.0934 1.0944 1.0941 1.0956
irintensity: 0.6004 0.4291 1.1284 0.5915 2.1926 0.4931 2.2269 3.5008 0.8930 0.7774 5.7802 2.5813 1.9857 4.1112 0.6657 0.7429 4.5485 1.7309 5.6225 2.8039 1.0677 7.6532 10.0923 8.7681 5.6920 7.9057 10.5502 3.1898 10.8052 5.5876 6.3054 5.1359 0.5248 4.9948 3.4867 13.1883 0.6975 6.0111 12.4708 14.5121 13.0924 118.4157 17.1165 9.2239 15.4092 7.3836 19.3995 0.2413 3.1621 1.1935 0.3518 4.3328 15.3109 2.9074 12.8948 21.7831 9.1473 0.8528 0.8940 0.3792 17.5129 9.3540 1.2447 17.8661 9.8907 23.4222 199.0489 18.0849 30.2588 48.9189 10.6419 52.9643 39.8137 19.4749 3.5310 116.4654 291.6742 5.6640 0.9434 11.7571 10.6639 62.7291 16.1537 9.4134 4.5943 16.1581 32.7137 24.3718 25.7799 9.1973 5.5237 126.4282 103.5450 50.0930 14.9946 486.0229 296.3125 65.3716 435.8115 50.0641 113.4512 10.4258 15.3553 4.1883 42.4664 8.6862 12.8153 7.3581 2.4315 28.0125 3.1513 7.3665 3.0274 5.6053 0.4248 2.0088 6.6270 6.8183 2.5712 0.4339
temp: 298.150 k
press: 1.00000 atm
elementType: 7 7 6 6 6 6 6 6 6 6 6 6 6 6 6 6 6 6 6 6 6 1 1 1 1 1 1 1 1 1 1 1 1 1 1 1 1 1 1 1 1 1
symmnumber: 1
zpe: 926143.8 jmol-1
zpe.correction: 0.352750 hartree
zpe.thermalcorrener: 0.372249 hartree
zpe.thermalcorrenthalpy: 0.373193 hartree
zpe.thermalcorrgfe: 0.304722 hartree
zpe.sumelectzpe: -844.434028 hartree
zpe.sumelectthermal: -844.414529 hartree
zpe.sumelectthermalent: -844.413584 hartree
zpe.sumelectthermalfe: -844.482055 hartree
dipole: 1.2983 -0.9039 0.2640
dipole: 1.6038
quadrupole: -9.0150 -97.7721 -124.1144
quadrupole: 0.2443 -0.1022 0.2462
quadrupole: 67.9522 -20.8049 -47.1472 0.2443 -0.1022 0.2462
hfenergy: -844.7867775 hartree
pointgroup: C01 [X(C19H21N2)]
dipole: -0.5144889 -0.3229636 0.170706 debye
polarizability: 591.2170341|-4.8484086|154.8951253|6.8168602|-42.7705927|158.3108272 unknown
InChI: InChI=1S/C19H21N2/c1-14-5-11-19-16(13-14)8-12-18(21(19)4)15-6-9-17(10-7-15)20(2)3/h5-13H,1-4H3
charge 1 multiplicity 1
42 atoms
N  1.043429 -0.7466 0.156613
N  -5.549773 -0.049165 0.088691
C  2.44199 -0.516978 0.186097
C  0.160226 0.170031 -0.407537
C  2.987041 0.625206 -0.500224
C  -1.29231 0.044152 -0.271865
C  0.714081 1.286914 -1.115922
C  2.082074 1.507592 -1.176188
C  3.329388 -1.3954 0.868678
C  4.396789 0.84803 -0.489676
C  0.564306 -2.073854 0.636888
C  5.275641 -0.019571 0.175699
C  -2.143913 0.41737 -1.359997
C  -1.930809 -0.34152 0.950531
C  4.707392 -1.142685 0.859044
C  -4.174916 -0.017365 -0.027339
C  -3.534717 0.373877 -1.256184
C  -3.320551 -0.363277 1.079064
C  6.772326 0.206285 0.189052
C  -6.184517 -0.456025 1.358515
C  -6.405746 0.340252 -1.05037
H  0.015759 1.999395 -1.558881
H  2.47833 2.3780 -1.709416
H  2.95829 -2.258974 1.424318
H  4.788157 1.724598 -1.018679
H  0.573517 -2.13398 1.738256
H  -0.458312 -2.240679 0.276556
H  1.217943 -2.858235 0.223494
H  -1.701274 0.700485 -2.321572
H  -1.326146 -0.563662 1.836476
H  5.373506 -1.8255 1.398851
H  -4.134465 0.638287 -2.129996
H  -3.752949 -0.625494 2.047429
H  7.054439 1.119748 -0.359079
H  7.151773 0.300459 1.223192
H  7.30672 -0.644262 -0.273166
H  -7.277375 -0.446931 1.238896
H  -5.925649 0.236956 2.181955
H  -5.882932 -1.479666 1.650184
H  -7.461909 0.26619 -0.754167
H  -6.248354 -0.324928 -1.920667
H  -6.211801 1.383625 -1.363252
