program: Gaussian 09
title: 000090378
version: EM64L-G09RevD.01
frameworkgroup: C1[X(C10H8BrCl3O2)]
method: RPBEPBE
basis: SDD
operation: Freq
keyword: #p
keyword: freq=noraman
keyword: PBEPBE/SDD
title: #p freq=noraman PBEPBE/SDD
converged: YES YES NO NO
title: Mulliken charges:
elementType: Br Cl Cl Cl O O C C C C C C C C C C H H H H H H H H
charge: 0.006971 0.014420 0.034789 0.006921 -0.280343 -0.243775 0.190439 0.561636 -0.315997 -0.315689 -0.705256 -0.310378 -0.350714 -0.055609 -0.211426 -0.116123 0.241265 0.221996 0.242714 0.225574 0.306579 0.292613 0.295054 0.264341
chargesum: 0.00000
title: Mulliken charges with hydrogens summed into heavy atoms:
elementType: Br Cl Cl Cl O O C C C C C C C C C C
charge: 0.006971 0.014420 0.034789 0.006921 -0.280343 -0.243775 0.190439 0.561636 0.147264 0.152598 -0.106065 -0.310378 -0.055660 -0.055609 0.052915 -0.116123
polarizability: 1.88714040e+02 1.90587220e+01 1.26150869e+02 -1.11924137e+00 1.37365343e+01 1.48402929e+02
1716.lowfreq: -4.5904 -3.8925 -0.0023 -0.0017 -0.0006 4.9532 28.9526 31.8156 38.4821
frequency: 28.9263 31.7682 38.3650 69.3023 93.3079 105.0902 139.9928 191.2230 202.4194 214.7875 229.1180 243.6741 254.8991 297.3352 319.5970 329.4583 358.2667 467.5286 473.5424 509.6754 520.6899 556.2062 611.5164 614.1364 637.4186 680.5144 726.2376 738.2743 762.8048 812.3542 835.7043 862.9152 893.8533 919.4565 961.5482 975.5864 976.7207 1007.1091 1047.9144 1090.5030 1118.8692 1151.5154 1157.4914 1162.2881 1175.0341 1202.2801 1231.2720 1261.9109 1318.6387 1329.0964 1346.2661 1352.9162 1426.7231 1430.2489 1470.8051 1477.3465 1550.9332 1582.4066 3002.6050 3009.5504 3076.5651 3103.6409 3116.1405 3168.0003 3171.9391 3193.8984
redmass: 16.9725 5.9236 5.9814 10.3581 8.1405 9.3065 4.9006 16.0341 3.8602 18.3928 6.3814 6.1179 5.9492 4.8372 6.8926 18.8849 4.5613 8.2214 6.0042 5.1103 5.8577 8.4970 2.5860 4.6850 5.7339 6.1343 8.8733 6.6970 5.8420 2.3394 1.5809 2.5047 4.0559 2.8839 2.4034 2.8734 1.4012 5.6758 3.5335 2.4069 2.2637 2.0224 1.6320 1.2133 1.5769 1.3160 1.3258 2.3313 1.2832 1.2488 4.0582 10.7775 1.6345 1.5537 1.0904 1.0955 8.5066 7.5527 1.0678 1.0613 1.0564 1.1004 1.1046 1.1103 1.0898 1.0956
irintensity: 0.5423 3.4150 2.3588 1.6832 1.0835 1.8032 1.4705 0.8666 2.2323 0.0471 1.6496 2.4186 1.8869 4.1012 5.4890 0.0203 0.3154 9.7317 25.6362 2.7607 4.9837 5.2071 4.1746 3.2546 54.6356 24.5461 36.9667 3.3927 41.5566 18.7723 24.6931 1.1040 31.4239 49.2094 20.9255 9.3344 1.5456 87.7360 57.9832 36.9446 47.7381 11.2359 15.8585 15.6839 45.4468 6.7807 19.0282 121.8841 11.1128 2.1091 58.3152 5.9988 14.6546 52.3921 5.1339 3.5303 1.7942 33.9341 60.3441 50.3657 9.5656 19.3594 24.0141 1.4856 0.5750 2.6040
temp: 298.150 k
press: 1.00000 atm
elementType: 35 17 17 17 8 8 6 6 6 6 6 6 6 6 6 6 1 1 1 1 1 1 1 1
symmnumber: 1
zpe: 415212.6 jmol-1
zpe.correction: 0.158146 hartree
zpe.thermalcorrener: 0.173944 hartree
zpe.thermalcorrenthalpy: 0.174888 hartree
zpe.thermalcorrgfe: 0.111692 hartree
zpe.sumelectzpe: -1928.732724 hartree
zpe.sumelectthermal: -1928.716926 hartree
zpe.sumelectthermalent: -1928.715982 hartree
zpe.sumelectthermalfe: -1928.779178 hartree
dipole: 3.1418 3.3449 -2.6342
dipole: 5.2913
quadrupole: -120.7546 -118.9512 -117.9276
quadrupole: 12.3471 -0.7887 -4.8126
quadrupole: -1.5435 0.2600 1.2835 12.3471 -0.7887 -4.8126
hfenergy: -1928.8908701 hartree
pointgroup: C01 [X(C10H8Br1Cl3O2)]
dipole: 1.5694839 0.9290338 1.0036674 debye
dipolederiv: -0.1406758 0.0095003 -0.08993 0.0328051 -0.1117018 0.0695289 -0.0397512 -0.0160141 -0.4747893 -0.1227484 0.1514203 0.0182125 0.1883651 -0.5880286 0.0680183 -0.0014634 0.0751584 -0.0447171 -0.3583213 -0.2880438 0.1008334 -0.3329275 -0.2928233 0.0978888 0.1154639 0.0990351 -0.0340714 -0.7336925 0.2281458 0.042869 0.2239849 -0.1348888 -0.0074319 0.0440418 -0.0057932 -0.0295867 -0.9608077 -0.2381498 -0.152046 -0.2284933 -0.4975445 -0.1517934 -0.1723197 -0.050726 -0.5720747 -0.7704349 -0.0966936 -0.2311305 -0.043971 -0.3987296 -0.19035 -0.3045342 -0.0712615 -0.9170296 1.3245771 0.1563258 -0.0906972 0.10336 0.488522 0.4174915 0.1139837 0.1261399 0.8346185 -0.2525692 0.0174498 -0.0157849 0.0088333 -0.2566248 -0.0001122 -0.0199371 0.0072247 -0.1145536 0.6333341 0.0771393 0.1270178 -0.0673553 0.2127313 0.0180136 0.2864516 0.153496 0.3225781 0.3628105 0.0028483 0.1985091 0.1770211 0.2914758 0.3282748 0.1180682 0.07251 0.3690467 -0.0982578 0.016653 0.3391118 -0.079163 -0.0206546 -0.2739365 0.0888685 -0.096459 0.6324713 0.1360734 -0.3180163 0.0245985 -0.2638744 0.79672 -0.0817248 0.0710347 -0.1086107 -0.0197786 -0.0103692 -0.0184304 -0.0192305 -0.0812107 0.016599 -0.0132512 -0.0197951 -0.0437469 -0.0879068 0.2323015 0.6133069 -0.1554698 0.6566917 0.2083202 -0.1375996 -0.1646915 -0.1312105 0.0309953 -0.2957799 0.0387715 0.0248854 0.0044271 -0.0086386 -0.0287179 0.0485387 -0.0321341 -0.082817 0.9825114 -0.4452063 -0.0388667 -0.3866232 0.1486174 0.0095812 -0.0478845 0.0161744 -0.0434832 0.0533171 -0.0150139 -0.0292178 -0.0928897 -0.0817115 -0.0747616 -0.036882 -0.0615723 0.0727996 -0.1860236 0.0217868 0.0283665 0.1352407 0.0452772 -0.0170739 0.0385262 -0.0310784 -0.005051 -0.0124453 0.0465405 -0.1095355 0.0617651 0.0589448 0.0508867 -0.1028216 0.0155896 -0.0033846 -0.0269128 0.052001 0.0881242 -0.005721 -0.0286431 -0.1578855 0.0483852 -0.0559375 -0.061797 0.1429227 -0.045717 -0.0750978 -0.0323421 0.0075935 -0.000502 -0.0623091 0.0678331 -0.0137605 -0.0906798 0.0321734 -0.0146404 0.0377359 0.1009742 0.030152 -0.015618 0.0151019 -0.0422412 0.1304915 -0.0332221 0.0241566 -0.0544206 0.0515899 0.0145111 0.0172024 0.0222894 0.1308708 0.0613789 0.0344304 0.0049623 0.0387619 -0.0073761 0.0307935 -0.0025575 0.0339914 0.1536619 unknown
polarizability: 193.8115006|-4.1193247|149.9794446|0.2848923|-12.0677358|119.4768932 unknown
InChI: InChI=1S/C10H8BrCl3O2/c11-5-10(15-3-4-16-10)6-1-2-7(12)9(14)8(6)13/h1-2H,3-5H2
charge 0 multiplicity 1
24 atoms
Br 1.397161 -0.463379 -3.135908
Cl -0.404843 -2.551433 0.495962
Cl -3.476229 -1.72347 0.718768
Cl -4.373687 1.35011 0.198718
O  2.346165 1.125762 -0.277809
O  2.114792 -0.835202 1.037764
C  1.613356 -0.154451 -0.188955
C  0.112599 0.160504 -0.086809
C  3.418069 1.09978 0.74739
C  2.817046 0.200796 1.836387
C  2.034969 -1.095926 -1.331635
C  -0.867738 -0.818998 0.21605
C  -0.323464 1.486936 -0.319393
C  -2.240258 -0.476052 0.312684
C  -1.681435 1.843091 -0.235536
C  -2.636073 0.861432 0.085275
H  3.589611 2.142701 1.055181
H  4.343153 0.667867 0.320438
H  3.557253 -0.325982 2.457088
H  2.093738 0.748087 2.469515
H  1.610218 -2.099089 -1.195861
H  3.131562 -1.130839 -1.394505
H  0.430123 2.236198 -0.56914
H  -2.003287 2.871057 -0.420668
